program: Orca
programVersion: 5.0.2
elementType: S S S P O O C C C C C C H H H H H H H H H H H H H H H
charge: 0
multiplicity: 1
keywords: wb97x-d3
keywords: def2-TZVPP
keywords: def2/J RIJCOSX
keywords: DEFGRID2
keywords: scfconv7
keywords: smallprint printgap noloewdin
keywords: NOSOSCF
formula: C6H15O2PS3
InChI: InChI=1/C6H15O2PS3/c1-4-11-5-6-12-9(10,7-2)8-3/h4-6H2,1-3H3
27 atoms
S  -0.647165 0.140297 -1.758363
S  3.286438 1.274573 0.002139
S  -3.29795 -1.127085 -0.327426
P  -1.530528 -0.461445 0.027788
O  -0.482781 -1.41791 0.768552
O  -1.416767 0.736621 1.086389
C  1.14006 0.22132 -1.35721
C  1.524616 1.347176 -0.420253
C  3.315838 -0.156787 1.12479
C  2.618929 0.067926 2.45107
C  -0.304756 -2.76995 0.341645
C  -2.160972 1.938535 0.881755
H  1.617929 0.355403 -2.328693
H  1.448782 -0.75259 -0.982541
H  0.938401 1.339915 0.496179
H  1.357895 2.314274 -0.897063
H  2.909814 -1.032643 0.614977
H  4.376787 -0.359686 1.282774
H  3.045414 0.917093 2.984854
H  1.549579 0.243636 2.333129
H  2.731006 -0.816157 3.082053
H  0.137515 -2.820073 -0.653757
H  -1.250607 -3.311795 0.341295
H  0.371692 -3.23273 1.054606
H  -1.853678 2.444997 -0.03494
H  -1.95077 2.584258 1.730489
H  -3.2323 1.737551 0.84139
elementType: S P O C H
totalener: -1924.23900403 hartree
nucrepener: 1284.47024359 hartree
electener: -3208.70924762 hartree
oneelecener: -5207.65171963 hartree
twoeener: 1998.94247201 hartree
cpcmener: -0.01923098 hartree
kineticenergy: 1919.62189210 hartree
xcener: -112.324055660078 hartree
chargesum: 0.0000000
charge: -0.170773 -0.176410 -0.440840 0.615850 -0.332074 -0.330512 -0.094042 -0.147149 -0.109346 -0.249904 -0.117740 -0.117148 0.134551 0.111883 0.106916 0.129226 0.091788 0.112029 0.084452 0.074941 0.095839 0.114563 0.122383 0.128909 0.112621 0.129602 0.120385
qa: -0.1708 -0.1764 -0.4408 0.6159 -0.3321 -0.3305 -0.0940 -0.1471 -0.1093 -0.2499 -0.1177 -0.1171 0.1346 0.1119 0.1069 0.1292 0.0918 0.1120 0.0845 0.0749 0.0958 0.1146 0.1224 0.1289 0.1126 0.1296 0.1204
va: 2.2942 2.1743 2.0385 5.4397 2.0891 2.0783 3.8792 3.9640 3.9544 3.9044 3.8415 3.8384 1.0127 1.0140 1.0238 1.0109 1.0075 1.0007 1.0153 1.0130 1.0044 0.9878 1.0066 0.9884 0.9950 0.9894 1.0041
dispcorr: -0.013345865 hartree
energy: -1924.252349891183
dipole: 13.49155 -12.13415 1.35740 0.48599 -0.56258 -0.07659 8.78648 -8.41191 0.37457
magnitude: 1.41021 au
magnitude: 3.58448 debye
