program: Orca
programVersion: 5.0.2
elementType: S S S P O O C C C C C C H H H H H H H H H H H H H H H
charge: 0
multiplicity: 1
keywords: wb97x-d3
keywords: def2-TZVPP
keywords: def2/J RIJCOSX
keywords: DEFGRID2
keywords: scfconv7
keywords: smallprint printgap noloewdin
keywords: NOSOSCF
formula: C6H15O2PS3
InChI: InChI=1/C6H15O2PS3/c1-4-11-5-6-12-9(10,7-2)8-3/h4-6H2,1-3H3
27 atoms
S  -0.404215 0.369493 -1.914118
S  3.498652 1.001339 0.098324
S  -3.09766 -1.225662 -0.927449
P  -1.552796 -0.259857 -0.313022
O  -0.598409 -1.032075 0.726515
O  -1.797751 1.098261 0.496437
C  1.023721 1.18382 -1.091264
C  2.190284 0.235951 -0.897667
C  2.790404 0.789652 1.759962
C  2.912554 -0.620954 2.299641
C  -0.287667 -2.416279 0.554423
C  -2.542572 1.095352 1.72032
H  0.68504 1.625728 -0.1558
H  1.300177 2.007067 -1.749871
H  2.633484 -0.025478 -1.859397
H  1.882447 -0.697883 -0.427832
H  3.325962 1.492586 2.399911
H  1.749293 1.117269 1.746666
H  2.438231 -1.354113 1.645828
H  3.9568 -0.90866 2.421611
H  2.42811 -0.694674 3.275753
H  0.356722 -2.572716 -0.31269
H  -1.193619 -3.01246 0.439097
H  0.236315 -2.735261 1.452087
H  -1.971675 0.635751 2.527028
H  -3.49422 0.574494 1.604756
H  -2.736824 2.135901 1.968951
elementType: S P O C H
totalener: -1924.23898055 hartree
nucrepener: 1274.83319590 hartree
electener: -3199.07217644 hartree
oneelecener: -5188.37824690 hartree
twoeener: 1989.30607045 hartree
cpcmener: -0.01941303 hartree
kineticenergy: 1919.60842791 hartree
xcener: -112.319431589466 hartree
chargesum: -0.0000000
charge: -0.158714 -0.179137 -0.448443 0.625741 -0.336263 -0.342225 -0.108149 -0.129803 -0.095559 -0.258582 -0.125567 -0.108063 0.115204 0.132437 0.132023 0.094874 0.110252 0.090102 0.075797 0.088508 0.095884 0.119191 0.126034 0.129570 0.121454 0.106739 0.126696
qa: -0.1587 -0.1791 -0.4484 0.6257 -0.3363 -0.3422 -0.1081 -0.1298 -0.0956 -0.2586 -0.1256 -0.1081 0.1152 0.1324 0.1320 0.0949 0.1103 0.0901 0.0758 0.0885 0.0959 0.1192 0.1260 0.1296 0.1215 0.1067 0.1267
va: 2.2996 2.1652 2.0242 5.4221 2.0385 2.0753 3.8505 3.9743 3.9264 3.9263 3.8308 3.8484 1.0310 1.0152 1.0087 1.0145 1.0032 1.0155 1.0001 1.0134 1.0042 0.9857 1.0123 0.9857 0.9914 1.0035 0.9892
dispcorr: -0.012910024 hartree
energy: -1924.251890571085
dipole: 12.32403 -11.30736 1.01667 -1.95157 1.93322 -0.01835 15.00213 -13.22123 1.78090
magnitude: 2.05075 au
magnitude: 5.21258 debye
