program: Orca
programVersion: 5.0.2
elementType: S S S P O O C C C C C C H H H H H H H H H H H H H H H
charge: 0
multiplicity: 1
keywords: wb97x-d3
keywords: def2-TZVPP
keywords: def2/J RIJCOSX
keywords: DEFGRID2
keywords: scfconv7
keywords: smallprint printgap noloewdin
keywords: NOSOSCF
formula: C6H15O2PS3
InChI: InChI=1/C6H15O2PS3/c1-4-11-5-6-12-9(10,7-2)8-3/h4-6H2,1-3H3
27 atoms
S  -0.527978 -0.167575 -1.673323
S  3.615586 0.695541 -0.306803
S  -3.311626 -1.295164 -0.367001
P  -1.672032 -0.383103 0.047789
O  -0.75012 -1.025093 1.189042
O  -1.775893 1.063592 0.724424
C  0.961139 0.740776 -1.095274
C  2.098287 -0.195111 -0.742324
C  3.165752 1.49333 1.263995
C  2.743037 0.537616 2.359973
C  -0.428933 -2.417965 1.141451
C  -2.550202 2.08883 0.098772
H  0.683236 1.388215 -0.264476
H  1.238995 1.38613 -1.929064
H  2.366576 -0.809519 -1.603365
H  1.824406 -0.877797 0.061396
H  4.069099 2.031343 1.557693
H  2.399632 2.25032 1.088955
H  2.57315 1.089517 3.286749
H  1.811819 0.024317 2.119923
H  3.507643 -0.21517 2.551871
H  0.178516 -2.628416 2.017706
H  0.142373 -2.664839 0.244399
H  -1.329954 -3.031482 1.172804
H  -2.146137 2.349924 -0.88066
H  -2.496663 2.958918 0.748048
H  -3.592057 1.785716 -0.010734
elementType: S P O C H
totalener: -1924.24051446 hartree
nucrepener: 1269.10040484 hartree
electener: -3193.34091930 hartree
oneelecener: -5176.86894952 hartree
twoeener: 1983.52803022 hartree
cpcmener: -0.01923580 hartree
kineticenergy: 1919.60863727 hartree
xcener: -112.321213395118 hartree
chargesum: -0.0000000
charge: -0.171426 -0.176307 -0.442983 0.620126 -0.332002 -0.336884 -0.087611 -0.147032 -0.119725 -0.237746 -0.127701 -0.113891 0.121905 0.126416 0.129330 0.104732 0.112329 0.093550 0.097195 0.070527 0.082670 0.130450 0.113625 0.128826 0.112962 0.130563 0.118103
qa: -0.1714 -0.1763 -0.4430 0.6201 -0.3320 -0.3369 -0.0876 -0.1470 -0.1197 -0.2377 -0.1277 -0.1139 0.1219 0.1264 0.1293 0.1047 0.1123 0.0935 0.0972 0.0705 0.0827 0.1304 0.1136 0.1288 0.1130 0.1306 0.1181
va: 2.2921 2.1819 2.0298 5.4467 2.0841 2.0835 3.8386 4.0001 3.9651 3.9004 3.8345 3.8385 1.0229 1.0206 1.0066 1.0138 0.9996 1.0055 1.0057 1.0053 1.0148 0.9878 0.9903 1.0072 0.9936 0.9904 1.0028
dispcorr: -0.012682153 hartree
energy: -1924.253196608978
dipole: 12.85860 -11.76437 1.09422 5.29191 -4.34907 0.94285 9.40336 -8.74268 0.66067
magnitude: 1.58832 au
magnitude: 4.03720 debye
