program: Orca
programVersion: 5.0.2
elementType: S S S P O O C C C C C C H H H H H H H H H H H H H H H
charge: 0
multiplicity: 1
keywords: wb97x-d3
keywords: def2-TZVPP
keywords: def2/J RIJCOSX
keywords: DEFGRID2
keywords: scfconv7
keywords: smallprint printgap noloewdin
keywords: NOSOSCF
formula: C6H15O2PS3
InChI: InChI=1/C6H15O2PS3/c1-4-11-5-6-12-9(10,7-2)8-3/h4-6H2,1-3H3
27 atoms
S  -0.129191 -1.232331 -0.726827
S  3.252553 1.423673 0.413869
S  -3.282143 -1.581086 0.175053
P  -1.781942 -0.37673 0.176831
O  -1.22478 0.108654 1.595446
O  -2.02334 1.044941 -0.530544
C  1.106367 0.128719 -0.74217
C  1.994414 0.118734 0.485797
C  4.453367 0.708702 -0.748869
C  5.274407 -0.425744 -0.168938
C  -2.104276 0.699476 2.561538
C  -2.598223 1.119559 -1.834882
H  0.595561 1.082614 -0.86488
H  1.683602 -0.047575 -1.650336
H  2.472633 -0.852467 0.619839
H  1.411032 0.314544 1.3849
H  3.937901 0.397894 -1.659064
H  5.100161 1.541029 -1.032191
H  5.984764 -0.793671 -0.912147
H  5.839936 -0.099226 0.703663
H  4.651984 -1.270197 0.129147
H  -1.561721 0.72354 3.503214
H  -3.010557 0.105869 2.687986
H  -2.372877 1.716325 2.275133
H  -3.604277 0.698926 -1.846666
H  -1.98301 0.599521 -2.571695
H  -2.647531 2.173903 -2.096236
elementType: S P O C H
totalener: -1924.23926994 hartree
nucrepener: 1235.25777317 hartree
electener: -3159.49704310 hartree
oneelecener: -5109.67679509 hartree
twoeener: 1950.17975199 hartree
cpcmener: -0.01860795 hartree
kineticenergy: 1919.60819864 hartree
xcener: -112.318734101862 hartree
chargesum: -0.0000000
charge: -0.161458 -0.176123 -0.450577 0.628287 -0.336432 -0.337539 -0.111000 -0.136312 -0.103995 -0.252353 -0.110527 -0.106244 0.116679 0.135174 0.109284 0.122185 0.094042 0.106168 0.092816 0.081096 0.086291 0.123852 0.106926 0.123786 0.115878 0.110941 0.129154
qa: -0.1615 -0.1761 -0.4506 0.6283 -0.3364 -0.3375 -0.1110 -0.1363 -0.1040 -0.2524 -0.1105 -0.1062 0.1167 0.1352 0.1093 0.1222 0.0940 0.1062 0.0928 0.0811 0.0863 0.1239 0.1069 0.1238 0.1159 0.1109 0.1292
va: 2.2969 2.1696 2.0187 5.4274 2.0907 2.0488 3.8510 3.9662 3.9504 3.9159 3.8493 3.8375 1.0368 1.0060 1.0121 1.0224 1.0085 1.0018 1.0053 1.0124 1.0015 0.9894 1.0035 0.9904 1.0047 0.9931 0.9907
dispcorr: -0.010963484 hartree
energy: -1924.250233419478
dipole: 16.92087 -15.78217 1.13870 6.46683 -5.26125 1.20558 -1.99149 1.31039 -0.68110
magnitude: 1.79275 au
magnitude: 4.55682 debye
