program: Orca
programVersion: 5.0.2
elementType: S S S P O O C C C C C C H H H H H H H H H H H H H H H
charge: 0
multiplicity: 1
keywords: wb97x-d3
keywords: def2-TZVPP
keywords: def2/J RIJCOSX
keywords: DEFGRID2
keywords: scfconv7
keywords: smallprint printgap noloewdin
keywords: NOSOSCF
formula: C6H15O2PS3
InChI: InChI=1/C6H15O2PS3/c1-4-11-5-6-12-9(10,7-2)8-3/h4-6H2,1-3H3
27 atoms
S  -0.341855 1.45729 -0.178282
S  3.30425 -1.017894 -0.795666
S  -1.284641 -1.809618 0.263465
P  -1.73385 0.054242 0.455185
O  -2.051089 0.553482 1.941993
O  -3.051538 0.550063 -0.314506
C  1.245704 0.596592 0.151529
C  1.757125 -0.116087 -1.082695
C  4.542681 0.317847 -0.777147
C  4.872365 0.858512 0.600513
C  -2.92802 -0.207158 2.782812
C  -3.307579 0.13599 -1.657942
H  1.120797 -0.088616 0.988059
H  1.923346 1.386541 0.470488
H  1.893773 0.580226 -1.911579
H  1.03508 -0.867583 -1.403611
H  5.439009 -0.104762 -1.234138
H  4.198801 1.109127 -1.445617
H  5.242054 0.071335 1.25752
H  5.650416 1.621535 0.52686
H  4.00791 1.314872 1.081363
H  -3.927695 -0.28223 2.354829
H  -2.986372 0.32386 3.728917
H  -2.534465 -1.208261 2.957855
H  -3.48023 -0.939004 -1.711444
H  -2.48489 0.400524 -2.323507
H  -4.203272 0.659857 -1.979862
elementType: S P O C H
totalener: -1924.23598632 hartree
nucrepener: 1238.39214287 hartree
electener: -3162.62812919 hartree
oneelecener: -5116.35458561 hartree
twoeener: 1953.72645642 hartree
cpcmener: -0.01724013 hartree
kineticenergy: 1919.63176159 hartree
xcener: -112.321375070171 hartree
chargesum: -0.0000000
charge: -0.168922 -0.173056 -0.455338 0.656810 -0.339954 -0.349073 -0.090263 -0.142785 -0.101837 -0.249570 -0.122435 -0.107091 0.108209 0.140729 0.112255 0.111051 0.106352 0.094553 0.083737 0.092759 0.078035 0.124191 0.129169 0.110131 0.114495 0.109132 0.128716
qa: -0.1689 -0.1731 -0.4553 0.6568 -0.3400 -0.3491 -0.0903 -0.1428 -0.1018 -0.2496 -0.1224 -0.1071 0.1082 0.1407 0.1123 0.1111 0.1064 0.0946 0.0837 0.0928 0.0780 0.1242 0.1292 0.1101 0.1145 0.1091 0.1287
va: 2.2875 2.1670 1.9947 5.3987 2.0917 2.0780 3.8021 3.9815 3.9326 3.9291 3.8562 3.8502 1.0441 1.0111 1.0140 1.0313 1.0014 1.0095 1.0085 1.0056 1.0071 0.9880 0.9894 1.0005 1.0007 0.9946 0.9922
dispcorr: -0.010713332 hartree
energy: -1924.246699651392
dipole: 11.44963 -11.61174 -0.16211 3.82100 -2.57628 1.24472 -0.09819 -0.05524 -0.15343
magnitude: 1.26458 au
magnitude: 3.21430 debye
