program: Orca
programVersion: 5.0.2
elementType: S S S P O O C C C C C C H H H H H H H H H H H H H H H
charge: 0
multiplicity: 1
keywords: wb97x-d3
keywords: def2-TZVPP
keywords: def2/J RIJCOSX
keywords: DEFGRID2
keywords: scfconv7
keywords: smallprint printgap noloewdin
keywords: NOSOSCF
formula: C6H15O2PS3
InChI: InChI=1/C6H15O2PS3/c1-4-11-5-6-12-9(10,7-2)8-3/h4-6H2,1-3H3
27 atoms
S  -0.49825 1.315554 -0.232502
S  3.34003 -0.910863 -0.339024
S  -1.412738 -1.978329 -0.089756
P  -1.894699 -0.152916 0.269114
O  -2.282921 0.047319 1.804832
O  -3.190598 0.431953 -0.468332
C  1.071884 0.528118 0.298263
C  1.742585 -0.213685 -0.840371
C  4.398218 0.566225 -0.426847
C  5.821547 0.198102 -0.04988
C  -2.767973 1.285583 2.333984
C  -3.35845 0.327524 -1.884236
H  0.8826 -0.127292 1.146962
H  1.688043 1.353077 0.654579
H  1.889914 0.437837 -1.703502
H  1.123207 -1.051161 -1.16292
H  4.363538 0.96392 -1.442668
H  4.019004 1.335899 0.246924
H  6.462927 1.076996 -0.125667
H  5.88435 -0.170789 0.974356
H  6.228832 -0.566771 -0.711916
H  -3.815717 1.435404 2.075069
H  -2.181647 2.135978 1.982113
H  -2.67424 1.220375 3.415225
H  -4.402475 0.545251 -2.095816
H  -3.124845 -0.677369 -2.23906
H  -2.729798 1.049435 -2.406879
elementType: S P O C H
totalener: -1924.23708012 hartree
nucrepener: 1230.54730142 hartree
electener: -3154.78438154 hartree
oneelecener: -5100.57594970 hartree
twoeener: 1945.79156816 hartree
cpcmener: -0.01872598 hartree
kineticenergy: 1919.60887374 hartree
xcener: -112.320239563907 hartree
chargesum: -0.0000000
charge: -0.192255 -0.168702 -0.440504 0.650719 -0.335191 -0.342582 -0.088917 -0.126379 -0.119376 -0.253134 -0.110958 -0.106326 0.108147 0.134314 0.106248 0.120943 0.095440 0.094201 0.093454 0.088018 0.087963 0.120274 0.108924 0.126753 0.127505 0.106757 0.114664
qa: -0.1923 -0.1687 -0.4405 0.6507 -0.3352 -0.3426 -0.0889 -0.1264 -0.1194 -0.2531 -0.1110 -0.1063 0.1081 0.1343 0.1062 0.1209 0.0954 0.0942 0.0935 0.0880 0.0880 0.1203 0.1089 0.1268 0.1275 0.1068 0.1147
va: 2.2689 2.1880 2.0213 5.4266 2.1028 2.0785 3.8412 3.9526 4.0102 3.9182 3.8489 3.8571 1.0385 1.0098 1.0174 1.0290 0.9996 0.9974 1.0026 1.0071 1.0078 0.9913 1.0009 0.9893 0.9906 1.0023 0.9909
dispcorr: -0.010293038 hartree
energy: -1924.247373158531
dipole: 14.54237 -14.56036 -0.01799 8.92393 -6.30385 2.62008 -1.52341 1.26474 -0.25867
magnitude: 2.63288 au
magnitude: 6.69224 debye
