program: Orca
programVersion: 5.0.2
elementType: S S S P O O C C C C C C H H H H H H H H H H H H H H H
charge: 0
multiplicity: 1
keywords: wb97x-d3
keywords: def2-TZVPP
keywords: def2/J RIJCOSX
keywords: DEFGRID2
keywords: scfconv7
keywords: smallprint printgap noloewdin
keywords: NOSOSCF
formula: C6H15O2PS3
InChI: InChI=1/C6H15O2PS3/c1-4-11-5-6-12-9(10,7-2)8-3/h4-6H2,1-3H3
27 atoms
S  -0.500517 1.313904 -0.233867
S  3.339545 -0.910987 -0.339281
S  -1.408493 -1.980348 -0.067243
P  -1.896177 -0.15339 0.274035
O  -2.292974 0.059286 1.805966
O  -3.190857 0.421555 -0.473506
C  1.071575 0.530207 0.29671
C  1.739855 -0.217704 -0.839452
C  4.397021 0.566123 -0.436623
C  5.826419 0.19487 -0.085736
C  -2.779165 1.302367 2.322557
C  -3.347086 0.313816 -1.890462
H  0.88539 -0.120169 1.149845
H  1.688218 1.357807 0.645882
H  1.88411 0.428871 -1.706776
H  1.120693 -1.057921 -1.155191
H  4.345797 0.968691 -1.449818
H  4.029973 1.332746 0.247238
H  6.466718 1.074172 -0.166235
H  5.90641 -0.180936 0.934814
H  6.222126 -0.565594 -0.759699
H  -2.184174 2.148095 1.97404
H  -2.699658 1.242097 3.405209
H  -3.822731 1.456222 2.049529
H  -3.119947 -0.694559 -2.239509
H  -2.707216 1.027774 -2.410443
H  -4.387056 0.540828 -2.111816
elementType: S P O C H
totalener: -1924.23709466 hartree
nucrepener: 1230.47984115 hartree
electener: -3154.71693581 hartree
oneelecener: -5100.44018895 hartree
twoeener: 1945.72325314 hartree
cpcmener: -0.01872411 hartree
kineticenergy: 1919.60844330 hartree
xcener: -112.320134395742 hartree
chargesum: -0.0000000
charge: -0.192406 -0.168590 -0.440158 0.650670 -0.335264 -0.342616 -0.088431 -0.126858 -0.119310 -0.253088 -0.111216 -0.106549 0.108213 0.134262 0.106314 0.120914 0.095557 0.093932 0.093436 0.088238 0.087779 0.108920 0.126779 0.120393 0.107098 0.114442 0.127538
qa: -0.1924 -0.1686 -0.4402 0.6507 -0.3353 -0.3426 -0.0884 -0.1269 -0.1193 -0.2531 -0.1112 -0.1065 0.1082 0.1343 0.1063 0.1209 0.0956 0.0939 0.0934 0.0882 0.0878 0.1089 0.1268 0.1204 0.1071 0.1144 0.1275
va: 2.2692 2.1882 2.0217 5.4266 2.1032 2.0783 3.8399 3.9529 4.0103 3.9182 3.8490 3.8574 1.0385 1.0098 1.0175 1.0290 0.9995 0.9976 1.0026 1.0069 1.0081 1.0009 0.9893 0.9913 1.0019 0.9910 0.9906
dispcorr: -0.010289706 hartree
energy: -1924.247384364367
dipole: 14.56489 -14.57909 -0.01419 8.92945 -6.30785 2.62161 -1.70459 1.41910 -0.28549
magnitude: 2.63714 au
magnitude: 6.70309 debye
