program: Orca
programVersion: 5.0.2
elementType: S S S P O O C C C C C C H H H H H H H H H H H H H H H
charge: 0
multiplicity: 1
keywords: wb97x-d3
keywords: def2-TZVPP
keywords: def2/J RIJCOSX
keywords: DEFGRID2
keywords: scfconv7
keywords: smallprint printgap noloewdin
keywords: NOSOSCF
formula: C6H15O2PS3
InChI: InChI=1/C6H15O2PS3/c1-4-11-5-6-12-9(10,7-2)8-3/h4-6H2,1-3H3
27 atoms
S  -0.785527 1.352413 -1.045729
S  3.518998 0.907864 -0.017811
S  -0.803246 -1.87997 0.070488
P  -1.585987 -0.122215 0.18036
O  -1.567124 0.565587 1.625214
O  -3.146376 -0.014745 -0.17956
C  0.974836 0.861656 -1.136086
C  1.724371 1.12398 0.156155
C  3.767803 -0.815594 0.49901
C  3.364754 -1.862695 -0.519582
C  -1.980175 -0.167453 2.786312
C  -3.667728 -0.61524 -1.367335
H  1.374507 1.473275 -1.946378
H  1.028377 -0.180474 -1.448942
H  1.372142 0.479447 0.963276
H  1.564667 2.154563 0.475547
H  4.837131 -0.885627 0.709073
H  3.254136 -0.970957 1.449776
H  3.632369 -2.857277 -0.155835
H  2.289964 -1.862883 -0.700384
H  3.871676 -1.706312 -1.471782
H  -1.756562 0.461042 3.644998
H  -1.432792 -1.10624 2.877545
H  -3.051148 -0.372434 2.761211
H  -3.392581 -1.668838 -1.434691
H  -3.314137 -0.09394 -2.258956
H  -4.750817 -0.532119 -1.312842
elementType: S P O C H
totalener: -1924.23740436 hartree
nucrepener: 1264.00078806 hartree
electener: -3188.23819242 hartree
oneelecener: -5167.47093729 hartree
twoeener: 1979.23274488 hartree
cpcmener: -0.01492182 hartree
kineticenergy: 1919.61125538 hartree
xcener: -112.318923577431 hartree
chargesum: 0.0000000
charge: -0.163919 -0.176314 -0.458978 0.665149 -0.340790 -0.354077 -0.106965 -0.117029 -0.099231 -0.246463 -0.116580 -0.107081 0.128629 0.119438 0.093443 0.122432 0.106316 0.092631 0.096105 0.069638 0.082072 0.128923 0.108235 0.126318 0.109137 0.110755 0.128203
qa: -0.1639 -0.1763 -0.4590 0.6651 -0.3408 -0.3541 -0.1070 -0.1170 -0.0992 -0.2465 -0.1166 -0.1071 0.1286 0.1194 0.0934 0.1224 0.1063 0.0926 0.0961 0.0696 0.0821 0.1289 0.1082 0.1263 0.1091 0.1108 0.1282
va: 2.3076 2.1751 1.9937 5.3859 2.0761 2.0904 3.8698 3.9230 3.9566 3.8992 3.8446 3.8532 1.0143 1.0329 1.0337 1.0157 1.0010 1.0110 1.0062 1.0125 1.0149 0.9888 1.0032 0.9897 1.0023 0.9931 0.9905
dispcorr: -0.011724213 hartree
energy: -1924.249128570470
dipole: 6.84049 -7.58112 -0.74063 -6.64991 6.39030 -0.25961 1.69059 -1.41965 0.27094
magnitude: 0.83026 au
magnitude: 2.11035 debye
