program: Orca
programVersion: 5.0.2
elementType: S S S P O O C C C C C C H H H H H H H H H H H H H H H
charge: 0
multiplicity: 1
keywords: wb97x-d3
keywords: def2-TZVPP
keywords: def2/J RIJCOSX
keywords: DEFGRID2
keywords: scfconv7
keywords: smallprint printgap noloewdin
keywords: NOSOSCF
formula: C6H15O2PS3
InChI: InChI=1/C6H15O2PS3/c1-4-11-5-6-12-9(10,7-2)8-3/h4-6H2,1-3H3
27 atoms
S  -0.450546 0.26533 -1.892215
S  3.408562 1.267049 0.046448
S  -2.930268 -1.626201 -0.815497
P  -1.432263 -0.551716 -0.264547
O  -0.258694 -1.274176 0.549035
O  -1.768579 0.655401 0.741409
C  0.905006 1.216089 -1.096607
C  2.182632 0.406256 -0.976616
C  2.772189 0.872651 1.705407
C  3.100855 -0.533254 2.166277
C  -0.5232 -1.836003 1.843006
C  -2.841948 1.554707 0.462764
H  0.552936 1.587073 -0.134878
H  1.058314 2.087092 -1.733989
H  2.633591 0.259138 -1.958624
H  1.998146 -0.583009 -0.56052
H  3.219126 1.609915 2.374224
H  1.694939 1.05053 1.7262
H  2.719367 -1.288869 1.478804
H  4.177406 -0.677505 2.256536
H  2.652752 -0.723446 3.143706
H  0.305979 -2.499161 2.074445
H  -1.44781 -2.415809 1.842835
H  -0.583621 -1.056016 2.601394
H  -3.779773 1.018754 0.311416
H  -2.62731 2.160536 -0.41914
H  -2.939794 2.207534 1.326945
elementType: S P O C H
totalener: -1924.23933449 hartree
nucrepener: 1275.81337239 hartree
electener: -3200.05270688 hartree
oneelecener: -5190.45071518 hartree
twoeener: 1990.39800831 hartree
cpcmener: -0.01835892 hartree
kineticenergy: 1919.60740152 hartree
xcener: -112.318859811937 hartree
chargesum: 0.0000000
charge: -0.161477 -0.180108 -0.444901 0.618063 -0.337926 -0.334095 -0.117000 -0.136827 -0.091438 -0.275355 -0.118730 -0.103596 0.115881 0.137128 0.133267 0.106873 0.111902 0.087675 0.080562 0.094749 0.096281 0.122633 0.120501 0.124118 0.112747 0.111716 0.127356
qa: -0.1615 -0.1801 -0.4449 0.6181 -0.3379 -0.3341 -0.1170 -0.1368 -0.0914 -0.2754 -0.1187 -0.1036 0.1159 0.1371 0.1333 0.1069 0.1119 0.0877 0.0806 0.0947 0.0963 0.1226 0.1205 0.1241 0.1127 0.1117 0.1274
va: 2.2961 2.1617 2.0307 5.4309 2.0769 2.0438 3.8634 3.9353 3.9125 3.9236 3.8384 3.8404 1.0255 1.0121 1.0075 1.0239 1.0034 1.0164 1.0008 1.0134 1.0028 0.9877 1.0071 0.9902 1.0057 0.9926 0.9898
dispcorr: -0.013046310 hartree
energy: -1924.252380796083
dipole: 10.23367 -9.77494 0.45873 3.42984 -2.36840 1.06144 14.26222 -12.57803 1.68418
magnitude: 2.04293 au
magnitude: 5.19272 debye
