program: Orca
programVersion: 5.0.2
elementType: S S S P O O C C C C C C H H H H H H H H H H H H H H H
charge: 0
multiplicity: 1
keywords: wb97x-d3
keywords: def2-TZVPP
keywords: def2/J RIJCOSX
keywords: DEFGRID2
keywords: scfconv7
keywords: smallprint printgap noloewdin
keywords: NOSOSCF
formula: C6H15O2PS3
InChI: InChI=1/C6H15O2PS3/c1-4-11-5-6-12-9(10,7-2)8-3/h4-6H2,1-3H3
27 atoms
S  -0.448983 0.261969 -1.894511
S  3.406999 1.26588 0.048762
S  -2.932813 -1.618521 -0.809118
P  -1.428062 -0.551101 -0.263229
O  -0.255404 -1.27985 0.546176
O  -1.754418 0.657211 0.744717
C  0.907254 1.214239 -1.101939
C  2.184451 0.404418 -0.977874
C  2.762844 0.874279 1.705505
C  3.088854 -0.531029 2.169979
C  -0.519479 -1.843278 1.839472
C  -2.828561 1.558204 0.475536
H  0.554569 1.588821 -0.141834
H  1.061268 2.083017 -1.742189
H  2.638355 0.256503 -1.958377
H  1.998784 -0.584512 -0.561561
H  3.206558 1.612521 2.375378
H  1.685537 1.052404 1.720822
H  2.713058 -1.287467 1.48029
H  4.16476 -0.674559 2.26841
H  2.633455 -0.720735 3.144116
H  0.303371 -2.51645 2.064513
H  -1.450389 -2.412946 1.842344
H  -0.567362 -1.06513 2.600598
H  -2.618254 2.167337 -0.405124
H  -2.92126 2.207554 1.342914
H  -3.767642 1.023556 0.327267
elementType: S P O C H
totalener: -1924.23932562 hartree
nucrepener: 1276.30123799 hartree
electener: -3200.54056361 hartree
oneelecener: -5191.42473459 hartree
twoeener: 1990.88417098 hartree
cpcmener: -0.01833962 hartree
kineticenergy: 1919.60791219 hartree
xcener: -112.319005867100 hartree
chargesum: 0.0000000
charge: -0.161056 -0.180177 -0.444796 0.617549 -0.337931 -0.333968 -0.117412 -0.136818 -0.091275 -0.275747 -0.119065 -0.103512 0.115961 0.137298 0.133316 0.106850 0.111860 0.087588 0.080740 0.095036 0.096187 0.122925 0.120570 0.124094 0.111831 0.127285 0.112665
qa: -0.1611 -0.1802 -0.4448 0.6175 -0.3379 -0.3340 -0.1174 -0.1368 -0.0913 -0.2757 -0.1191 -0.1035 0.1160 0.1373 0.1333 0.1068 0.1119 0.0876 0.0807 0.0950 0.0962 0.1229 0.1206 0.1241 0.1118 0.1273 0.1127
va: 2.2965 2.1617 2.0308 5.4311 2.0763 2.0439 3.8634 3.9353 3.9119 3.9237 3.8382 3.8403 1.0254 1.0119 1.0075 1.0240 1.0035 1.0167 1.0008 1.0134 1.0028 0.9876 1.0073 0.9900 0.9926 0.9898 1.0058
dispcorr: -0.013072547 hartree
energy: -1924.252398163279
dipole: 10.21339 -9.75231 0.46109 3.42229 -2.36510 1.05719 14.26820 -12.58826 1.67994
magnitude: 2.03776 au
magnitude: 5.17957 debye
