program: Orca
programVersion: 5.0.2
elementType: S S S P O O C C C C C C H H H H H H H H H H H H H H H
charge: 0
multiplicity: 1
keywords: wb97x-d3
keywords: def2-TZVPP
keywords: def2/J RIJCOSX
keywords: DEFGRID2
keywords: scfconv7
keywords: smallprint printgap noloewdin
keywords: NOSOSCF
formula: C6H15O2PS3
InChI: InChI=1/C6H15O2PS3/c1-4-11-5-6-12-9(10,7-2)8-3/h4-6H2,1-3H3
27 atoms
S  -0.238548 1.495496 0.524328
S  3.109765 -1.07272 -0.870723
S  -1.52323 -1.63165 1.02992
P  -1.7719 0.11747 0.260936
O  -3.039954 0.952103 0.781168
O  -2.013861 0.166029 -1.320778
C  1.235718 0.411233 0.520239
C  1.558749 -0.135732 -0.855975
C  4.317794 0.286231 -0.887527
C  5.721857 -0.275366 -1.008026
C  -3.343143 1.018625 2.177267
C  -2.987784 -0.697409 -1.92355
H  1.084215 -0.386873 1.246326
H  2.033131 1.055598 0.892555
H  1.613424 0.66429 -1.59616
H  0.783914 -0.829653 -1.184309
H  4.095398 0.94165 -1.731712
H  4.225929 0.876754 0.025374
H  6.446097 0.539864 -1.020238
H  5.970818 -0.925029 -0.168196
H  5.849283 -0.846032 -1.928483
H  -2.569615 1.562414 2.724638
H  -3.453373 0.021629 2.607026
H  -4.286283 1.554328 2.269091
H  -2.77829 -1.744537 -1.70116
H  -2.919576 -0.539133 -2.997879
H  -3.996808 -0.449555 -1.5895
elementType: S P O C H
totalener: -1924.23867559 hartree
nucrepener: 1235.81177303 hartree
electener: -3160.05044863 hartree
oneelecener: -5111.20290583 hartree
twoeener: 1951.15245720 hartree
cpcmener: -0.01663401 hartree
kineticenergy: 1919.60818649 hartree
xcener: -112.318121577729 hartree
chargesum: -0.0000000
charge: -0.161292 -0.165020 -0.453823 0.655130 -0.354789 -0.340266 -0.110767 -0.113871 -0.118564 -0.253051 -0.106869 -0.115516 0.117173 0.133794 0.107587 0.109425 0.095745 0.093189 0.093500 0.088449 0.088004 0.110432 0.110775 0.128349 0.108539 0.128559 0.125176
qa: -0.1613 -0.1650 -0.4538 0.6551 -0.3548 -0.3403 -0.1108 -0.1139 -0.1186 -0.2531 -0.1069 -0.1155 0.1172 0.1338 0.1076 0.1094 0.0957 0.0932 0.0935 0.0884 0.0880 0.1104 0.1108 0.1283 0.1085 0.1286 0.1252
va: 2.3073 2.1954 2.0004 5.3959 2.0879 2.0744 3.8552 3.9392 4.0101 3.9172 3.8507 3.8459 1.0410 1.0047 1.0207 1.0268 0.9994 0.9980 1.0026 1.0065 1.0083 0.9933 1.0031 0.9908 1.0024 0.9891 0.9897
dispcorr: -0.010386689 hartree
energy: -1924.249062284098
dipole: 12.93784 -13.05770 -0.11986 1.79852 -0.51475 1.28378 -3.80654 3.65948 -0.14706
magnitude: 1.29772 au
magnitude: 3.29854 debye
