program: Orca
programVersion: 5.0.2
elementType: S S S P O O C C C C C C H H H H H H H H H H H H H H H
charge: 0
multiplicity: 1
keywords: wb97x-d3
keywords: def2-TZVPP
keywords: def2/J RIJCOSX
keywords: DEFGRID2
keywords: scfconv7
keywords: smallprint printgap noloewdin
keywords: NOSOSCF
formula: C6H15O2PS3
InChI: InChI=1/C6H15O2PS3/c1-4-11-5-6-12-9(10,7-2)8-3/h4-6H2,1-3H3
27 atoms
S  -0.108925 1.421557 -0.040888
S  3.322596 0.891537 -0.504973
S  -0.983371 -1.841015 -0.671414
P  -1.500836 -0.111678 0.007637
O  -1.952326 -0.061048 1.546271
O  -2.764888 0.560332 -0.706421
C  0.747831 1.111107 -1.62679
C  1.969151 0.226152 -1.510548
C  2.994441 0.29865 1.187127
C  2.712282 -1.184226 1.306977
C  -1.193615 -0.737736 2.550848
C  -3.918526 -0.231523 -1.020549
H  1.015709 2.10064 -1.996506
H  0.036216 0.687798 -2.337498
H  2.386646 0.110816 -2.514056
H  1.700976 -0.774761 -1.175241
H  3.913456 0.549564 1.721106
H  2.19449 0.88253 1.639884
H  1.751973 -1.455955 0.867248
H  3.488785 -1.78197 0.828521
H  2.673818 -1.466251 2.361087
H  -1.140569 -1.808413 2.351387
H  -1.709064 -0.574287 3.494289
H  -0.182041 -0.334721 2.627144
H  -4.351053 -0.682927 -0.127203
H  -3.672748 -1.014098 -1.738376
H  -4.645501 0.444599 -1.463434
elementType: S P O C H
totalener: -1924.23384278 hartree
nucrepener: 1294.18342710 hartree
electener: -3218.41726987 hartree
oneelecener: -5227.83038448 hartree
twoeener: 2009.41311461 hartree
cpcmener: -0.01547467 hartree
kineticenergy: 1919.63523821 hartree
xcener: -112.327133221722 hartree
chargesum: 0.0000000
charge: -0.154038 -0.181387 -0.458940 0.670857 -0.347022 -0.344649 -0.094689 -0.126006 -0.120063 -0.251741 -0.106767 -0.125495 0.124368 0.116210 0.122651 0.102824 0.113231 0.091602 0.054903 0.095169 0.101200 0.113826 0.132638 0.105917 0.123756 0.112634 0.129011
qa: -0.1540 -0.1814 -0.4589 0.6709 -0.3470 -0.3446 -0.0947 -0.1260 -0.1201 -0.2517 -0.1068 -0.1255 0.1244 0.1162 0.1227 0.1028 0.1132 0.0916 0.0549 0.0952 0.1012 0.1138 0.1326 0.1059 0.1238 0.1126 0.1290
va: 2.3011 2.1632 1.9861 5.3841 2.0808 2.0974 3.8664 3.9470 3.9663 3.8960 3.8561 3.8588 1.0172 1.0291 1.0058 1.0262 1.0001 1.0080 1.0253 1.0179 1.0032 1.0013 0.9928 0.9837 0.9877 0.9998 0.9903
dispcorr: -0.012897106 hartree
energy: -1924.246739881821
dipole: 4.83678 -5.57766 -0.74087 -5.14908 4.99092 -0.15816 4.83786 -4.35265 0.48521
magnitude: 0.89963 au
magnitude: 2.28668 debye
