program: Orca
programVersion: 5.0.2
elementType: S S S P O O C C C C C C H H H H H H H H H H H H H H H
charge: 0
multiplicity: 1
keywords: wb97x-d3
keywords: def2-TZVPP
keywords: def2/J RIJCOSX
keywords: DEFGRID2
keywords: scfconv7
keywords: smallprint printgap noloewdin
keywords: NOSOSCF
formula: C6H15O2PS3
InChI: InChI=1/C6H15O2PS3/c1-4-11-5-6-12-9(10,7-2)8-3/h4-6H2,1-3H3
27 atoms
S  -0.566608 1.281939 -0.682864
S  3.231869 -0.79136 0.348102
S  -1.478575 -1.990646 -0.466778
P  -1.833132 -0.188678 0.094635
O  -1.811717 -0.056211 1.686571
O  -3.268859 0.434849 -0.244677
C  1.010713 0.367115 -0.814348
C  1.628977 0.03522 0.529554
C  4.318498 0.620227 -0.013604
C  5.746671 0.128759 -0.16716
C  -2.078373 1.175902 2.363984
C  -3.799704 0.425675 -1.571758
H  1.651575 1.035054 -1.390259
H  0.840613 -0.529086 -1.408864
H  0.998944 -0.66175 1.083585
H  1.745456 0.929221 1.144129
H  3.99157 1.118744 -0.927061
H  4.248736 1.3394 0.804421
H  6.100292 -0.365401 0.738484
H  5.843882 -0.572683 -0.996226
H  6.409894 0.971219 -0.366076
H  -1.56054 2.017079 1.899373
H  -1.708992 1.060032 3.380016
H  -3.148145 1.380677 2.392849
H  -3.307176 1.172616 -2.195662
H  -4.856088 0.670388 -1.489743
H  -3.696529 -0.55662 -2.034674
elementType: S P O C H
totalener: -1924.23823176 hartree
nucrepener: 1240.54344093 hartree
electener: -3164.78167269 hartree
oneelecener: -5120.52888463 hartree
twoeener: 1955.74721194 hartree
cpcmener: -0.01863788 hartree
kineticenergy: 1919.61594648 hartree
xcener: -112.322091753676 hartree
chargesum: -0.0000000
charge: -0.189037 -0.164039 -0.435500 0.643482 -0.335650 -0.345186 -0.093773 -0.123543 -0.120243 -0.251977 -0.114816 -0.107071 0.133505 0.113641 0.112410 0.108519 0.094222 0.095665 0.088111 0.088513 0.093022 0.107804 0.127565 0.125166 0.114489 0.128042 0.106680
qa: -0.1890 -0.1640 -0.4355 0.6435 -0.3357 -0.3452 -0.0938 -0.1235 -0.1202 -0.2520 -0.1148 -0.1071 0.1335 0.1136 0.1124 0.1085 0.0942 0.0957 0.0881 0.0885 0.0930 0.1078 0.1276 0.1252 0.1145 0.1280 0.1067
va: 2.2825 2.1957 2.0333 5.4213 2.0825 2.0866 3.8450 3.9410 4.0115 3.9149 3.8463 3.8576 1.0050 1.0423 1.0291 1.0198 0.9976 0.9999 1.0081 1.0071 1.0027 1.0025 0.9882 0.9925 0.9919 0.9904 1.0016
dispcorr: -0.010665667 hartree
energy: -1924.248897429220
dipole: 14.47622 -14.44913 0.02709 8.97489 -6.35858 2.61631 0.29586 -0.41959 -0.12373
magnitude: 2.61937 au
magnitude: 6.65791 debye
