program: Orca
programVersion: 5.0.2
elementType: S S S P O O C C C C C C H H H H H H H H H H H H H H H
charge: 0
multiplicity: 1
keywords: wb97x-d3
keywords: def2-TZVPP
keywords: def2/J RIJCOSX
keywords: DEFGRID2
keywords: scfconv7
keywords: smallprint printgap noloewdin
keywords: NOSOSCF
formula: C6H15O2PS3
InChI: InChI=1/C6H15O2PS3/c1-4-11-5-6-12-9(10,7-2)8-3/h4-6H2,1-3H3
27 atoms
S  -0.885779 1.409953 -0.763993
S  3.400445 0.684691 0.13074
S  -0.745484 -1.947275 -0.164619
P  -1.634854 -0.284267 0.20792
O  -1.666058 0.020743 1.774882
O  -3.1918 -0.174247 -0.163857
C  0.886085 0.994038 -0.935075
C  1.649448 1.088449 0.370459
C  3.325511 -1.134945 0.122228
C  4.5452 -1.704105 -0.576263
C  -2.33583 1.161375 2.324213
C  -3.649244 -0.477236 -1.484432
H  1.265385 1.719388 -1.655503
H  0.956895 0.005728 -1.388815
H  1.232503 0.429953 1.134346
H  1.606721 2.104913 0.763433
H  3.263964 -1.496225 1.15006
H  2.415879 -1.45133 -0.390679
H  4.513363 -2.79428 -0.550363
H  4.583891 -1.394731 -1.621143
H  5.474348 -1.392663 -0.096251
H  -2.00254 1.249963 3.355282
H  -3.416404 1.024409 2.308379
H  -2.075803 2.078346 1.792638
H  -4.735387 -0.50433 -1.443484
H  -3.280223 -1.447844 -1.818852
H  -3.337774 0.289999 -2.194675
elementType: S P O C H
totalener: -1924.23778311 hartree
nucrepener: 1258.99777777 hartree
electener: -3183.23556088 hartree
oneelecener: -5157.37546225 hartree
twoeener: 1974.13990138 hartree
cpcmener: -0.01601764 hartree
kineticenergy: 1919.61030709 hartree
xcener: -112.320769598888 hartree
chargesum: -0.0000000
charge: -0.190088 -0.176509 -0.438730 0.650425 -0.336133 -0.345079 -0.091256 -0.120335 -0.101496 -0.255550 -0.114372 -0.107599 0.129419 0.115374 0.099946 0.122010 0.099054 0.084120 0.093112 0.084504 0.089995 0.127547 0.124257 0.108657 0.128066 0.108268 0.112394
qa: -0.1901 -0.1765 -0.4387 0.6504 -0.3361 -0.3451 -0.0913 -0.1203 -0.1015 -0.2555 -0.1144 -0.1076 0.1294 0.1154 0.0999 0.1220 0.0991 0.0841 0.0931 0.0845 0.0900 0.1275 0.1243 0.1087 0.1281 0.1083 0.1124
va: 2.2836 2.1778 2.0283 5.4084 2.0888 2.0816 3.8560 3.9351 3.9698 3.9419 3.8485 3.8566 1.0152 1.0338 1.0323 1.0143 1.0049 1.0092 1.0031 1.0106 1.0028 0.9884 0.9927 1.0007 0.9910 1.0005 0.9938
dispcorr: -0.011304705 hartree
energy: -1924.249087815704
dipole: 8.04307 -9.12922 -1.08615 -0.75438 1.78494 1.03055 -0.95774 0.75696 -0.20077
magnitude: 1.51066 au
magnitude: 3.83978 debye
