program: Orca
programVersion: 5.0.2
elementType: S S S P O O C C C C C C H H H H H H H H H H H H H H H
charge: 0
multiplicity: 1
keywords: wb97x-d3
keywords: def2-TZVPP
keywords: def2/J RIJCOSX
keywords: DEFGRID2
keywords: scfconv7
keywords: smallprint printgap noloewdin
keywords: NOSOSCF
formula: C6H15O2PS3
InChI: InChI=1/C6H15O2PS3/c1-4-11-5-6-12-9(10,7-2)8-3/h4-6H2,1-3H3
27 atoms
S  -0.544826 1.732338 0.477955
S  3.487433 0.620418 -0.99326
S  -0.339994 -1.685378 0.893979
P  -1.424736 -0.150908 0.478785
O  -2.60974 0.023246 1.539187
O  -2.099576 -0.175482 -0.979288
C  0.879667 1.422978 -0.640191
C  2.122526 1.02682 0.131138
C  3.060203 -1.098094 -1.4149
C  3.445913 -2.098523 -0.34389
C  -3.592712 1.061636 1.443271
C  -2.648445 -1.390616 -1.505377
H  1.032947 2.360914 -1.173748
H  0.59349 0.676816 -1.380757
H  1.927305 0.179662 0.78864
H  2.461416 1.85355 0.756528
H  1.993148 -1.153649 -1.638376
H  3.584802 -1.311485 -2.347818
H  4.520667 -2.089545 -0.16293
H  2.941333 -1.895411 0.600926
H  3.165575 -3.107847 -0.652442
H  -3.205997 1.998285 1.846396
H  -4.440746 0.746147 2.046875
H  -3.930062 1.21799 0.4186
H  -1.903566 -2.186316 -1.515951
H  -2.956871 -1.174848 -2.525661
H  -3.516162 -1.713972 -0.929078
elementType: S P O C H
totalener: -1924.23559035 hartree
nucrepener: 1268.13483781 hartree
electener: -3192.37042817 hartree
oneelecener: -5175.69315062 hartree
twoeener: 1983.32272246 hartree
cpcmener: -0.01803634 hartree
kineticenergy: 1919.61185859 hartree
xcener: -112.319086665600 hartree
chargesum: 0.0000000
charge: -0.180582 -0.182456 -0.449808 0.648280 -0.344256 -0.340026 -0.096977 -0.127163 -0.088623 -0.260038 -0.126252 -0.112191 0.131539 0.111663 0.099118 0.128333 0.082318 0.108761 0.086960 0.079112 0.094406 0.118598 0.128364 0.124726 0.112266 0.127548 0.126380
qa: -0.1806 -0.1825 -0.4498 0.6483 -0.3443 -0.3400 -0.0970 -0.1272 -0.0886 -0.2600 -0.1263 -0.1122 0.1315 0.1117 0.0991 0.1283 0.0823 0.1088 0.0870 0.0791 0.0944 0.1186 0.1284 0.1247 0.1123 0.1275 0.1264
va: 2.2713 2.1609 2.0051 5.4234 2.0944 2.0405 3.8751 3.9273 3.9159 3.9218 3.8627 3.8324 1.0151 1.0268 1.0352 1.0123 1.0238 1.0054 1.0140 1.0032 1.0037 0.9848 0.9910 0.9900 1.0070 0.9908 0.9868
dispcorr: -0.012025809 hartree
energy: -1924.247616162979
dipole: 2.96252 -4.65161 -1.68909 -4.91228 5.38177 0.46949 -6.04443 5.03813 -1.00630
magnitude: 2.02141 au
magnitude: 5.13801 debye
