program: Orca
programVersion: 5.0.2
elementType: S S S P O O C C C C C C H H H H H H H H H H H H H H H
charge: 0
multiplicity: 1
keywords: wb97x-d3
keywords: def2-TZVPP
keywords: def2/J RIJCOSX
keywords: DEFGRID2
keywords: scfconv7
keywords: smallprint printgap noloewdin
keywords: NOSOSCF
formula: C6H15O2PS3
InChI: InChI=1/C6H15O2PS3/c1-4-11-5-6-12-9(10,7-2)8-3/h4-6H2,1-3H3
27 atoms
S  -0.539513 1.719584 0.419237
S  3.541978 0.641225 -0.928297
S  -0.32572 -1.697065 0.756065
P  -1.433038 -0.156211 0.437712
O  -2.557412 -0.001282 1.565895
O  -2.193934 -0.147196 -0.979082
C  0.907784 1.386862 -0.663701
C  2.138824 1.041581 0.148536
C  3.16134 -1.092591 -1.328117
C  3.525672 -2.063547 -0.223506
C  -3.546951 1.034791 1.539934
C  -2.859746 -1.328547 -1.441664
H  1.057235 2.303288 -1.233972
H  0.645129 0.603958 -1.374314
H  1.945586 0.209142 0.825574
H  2.441804 1.893606 0.758627
H  2.10463 -1.174231 -1.589186
H  3.723931 -1.314539 -2.236594
H  4.595619 -2.044399 -0.016469
H  2.99692 -1.840639 0.70356
H  3.257673 -3.081822 -0.513341
H  -4.352951 0.713131 2.195485
H  -3.949719 1.195839 0.539771
H  -3.136786 1.970449 1.921986
H  -3.67499 -1.61425 -0.775631
H  -2.162876 -2.162042 -1.535506
H  -3.267232 -1.091604 -2.421474
elementType: S P O C H
totalener: -1924.23572543 hartree
nucrepener: 1265.99401611 hartree
electener: -3190.22974154 hartree
oneelecener: -5171.44404669 hartree
twoeener: 1981.21430515 hartree
cpcmener: -0.01801632 hartree
kineticenergy: 1919.61345900 hartree
xcener: -112.319058660860 hartree
chargesum: 0.0000000
charge: -0.183009 -0.181593 -0.447915 0.646998 -0.344432 -0.339050 -0.091950 -0.127199 -0.090958 -0.259930 -0.127018 -0.115089 0.131097 0.110232 0.098545 0.127974 0.083427 0.108929 0.087718 0.079372 0.094127 0.128691 0.125496 0.119398 0.124759 0.113084 0.128299
qa: -0.1830 -0.1816 -0.4479 0.6470 -0.3444 -0.3391 -0.0919 -0.1272 -0.0910 -0.2599 -0.1270 -0.1151 0.1311 0.1102 0.0985 0.1280 0.0834 0.1089 0.0877 0.0794 0.0941 0.1287 0.1255 0.1194 0.1248 0.1131 0.1283
va: 2.2699 2.1625 2.0099 5.4258 2.0918 2.0392 3.8673 3.9358 3.9149 3.9188 3.8606 3.8379 1.0166 1.0273 1.0333 1.0123 1.0243 1.0056 1.0137 1.0037 1.0038 0.9905 0.9894 0.9855 0.9862 1.0064 0.9905
dispcorr: -0.011973459 hartree
energy: -1924.247698890402
dipole: 2.81354 -4.56881 -1.75527 -4.78394 5.25375 0.46981 -4.97683 4.14449 -0.83234
magnitude: 1.99863 au
magnitude: 5.08010 debye
