program: Orca
programVersion: 5.0.2
elementType: S S S P O O C C C C C C H H H H H H H H H H H H H H H
charge: 0
multiplicity: 1
keywords: wb97x-d3
keywords: def2-TZVPP
keywords: def2/J RIJCOSX
keywords: DEFGRID2
keywords: scfconv7
keywords: smallprint printgap noloewdin
keywords: NOSOSCF
formula: C6H15O2PS3
InChI: InChI=1/C6H15O2PS3/c1-4-11-5-6-12-9(10,7-2)8-3/h4-6H2,1-3H3
27 atoms
S  -0.331107 1.345113 -0.684156
S  3.339556 -1.054861 -0.02373
S  -1.621728 -1.806687 -0.438811
P  -1.695788 0.020771 0.149463
O  -1.508664 0.268174 1.720103
O  -3.074383 0.802859 -0.114487
C  1.096167 0.243466 -0.981192
C  1.782509 -0.189204 0.300363
C  4.433592 0.341305 -0.412453
C  4.797349 1.195261 0.78858
C  -2.205521 -0.54884 2.658091
C  -3.744202 0.662993 -1.360353
H  1.758139 0.840195 -1.609823
H  0.764638 -0.616914 -1.561511
H  1.153164 -0.899682 0.837576
H  1.947206 0.65888 0.965791
H  5.327195 -0.116128 -0.839883
H  3.992318 0.94621 -1.207323
H  5.483942 1.991944 0.497457
H  3.921502 1.669371 1.231377
H  5.277757 0.596654 1.560781
H  -3.277278 -0.347513 2.635975
H  -1.815931 -0.295513 3.640763
H  -2.035852 -1.608428 2.462388
H  -4.002789 -0.378831 -1.554089
H  -3.13095 1.035683 -2.183549
H  -4.652287 1.2578 -1.296073
totalener: -1924.22200326 hartree
nucrepener: 1248.08235839 hartree
electener: -3172.30436165 hartree
oneelecener: -5135.34340376 hartree
twoeener: 1963.03904212 hartree
kineticenergy: 1919.67948331 hartree
xcener: -112.332147745098 hartree
chargesum: -0.0000000
charge: -0.145143 -0.108569 -0.398736 0.616296 -0.310133 -0.332826 -0.126462 -0.137249 -0.130975 -0.236144 -0.126080 -0.118186 0.110385 0.127708 0.107085 0.103269 0.100838 0.079353 0.084944 0.076879 0.087521 0.115156 0.117681 0.110319 0.113201 0.103383 0.116484
qa: -0.1451 -0.1086 -0.3987 0.6163 -0.3101 -0.3328 -0.1265 -0.1372 -0.1310 -0.2361 -0.1261 -0.1182 0.1104 0.1277 0.1071 0.1033 0.1008 0.0794 0.0849 0.0769 0.0875 0.1152 0.1177 0.1103 0.1132 0.1034 0.1165
va: 2.3077 2.2053 2.0529 5.4230 2.0964 2.1003 3.8828 3.9336 3.9850 3.9078 3.8694 3.8723 1.0115 1.0367 1.0358 1.0175 1.0039 1.0077 1.0066 1.0052 1.0134 0.9906 0.9897 1.0049 1.0038 0.9952 0.9915
dispcorr: -0.010847798 hartree
energy: -1924.232851055789
dipole: 11.27518 -11.41654 -0.14137 4.77991 -3.90695 0.87296 2.79770 -2.67956 0.11814
magnitude: 0.89219 au
magnitude: 2.26776 debye
