program: Orca
programVersion: 5.0.2
elementType: S S S P O O C C C C C C H H H H H H H H H H H H H H H
charge: 0
multiplicity: 1
keywords: wb97x-d3
keywords: def2-TZVPP
keywords: def2/J RIJCOSX
keywords: DEFGRID2
keywords: scfconv7
keywords: smallprint printgap noloewdin
keywords: NOSOSCF
formula: C6H15O2PS3
InChI: InChI=1/C6H15O2PS3/c1-4-11-5-6-12-9(10,7-2)8-3/h4-6H2,1-3H3
27 atoms
S  -0.457488 1.346817 -0.350623
S  3.321935 -0.981129 -0.213855
S  -1.494584 -1.857328 -0.87106
P  -1.757606 -0.237988 0.106555
O  -1.701302 -0.45651 1.687953
O  -3.166032 0.522962 -0.044616
C  1.041988 0.437869 -0.862791
C  1.744239 -0.249528 0.291638
C  4.386745 0.488954 -0.267687
C  4.745108 1.040888 1.099699
C  -1.909231 0.601619 2.615822
C  -3.711724 0.758147 -1.336629
H  1.671698 1.204817 -1.31554
H  0.769392 -0.277282 -1.638091
H  1.137834 -1.079647 0.656421
H  1.891214 0.434952 1.12837
H  5.285083 0.162178 -0.793722
H  3.930131 1.256078 -0.89649
H  5.243395 0.286115 1.705809
H  5.413418 1.898354 1.004391
H  3.86346 1.377062 1.645384
H  -1.261795 1.45451 2.401597
H  -1.65915 0.20726 3.597454
H  -2.948533 0.928952 2.616159
H  -3.808722 -0.172887 -1.896402
H  -3.091552 1.453033 -1.90603
H  -4.695674 1.195606 -1.188716
totalener: -1924.22091094 hartree
nucrepener: 1250.42132241 hartree
electener: -3174.64223335 hartree
oneelecener: -5139.92400526 hartree
twoeener: 1965.28177191 hartree
kineticenergy: 1919.66970435 hartree
xcener: -112.331906304749 hartree
chargesum: 0.0000000
charge: -0.191206 -0.104604 -0.364585 0.624671 -0.301233 -0.333909 -0.110388 -0.152094 -0.130241 -0.236036 -0.130979 -0.121168 0.112143 0.124699 0.121397 0.093998 0.101021 0.078311 0.087815 0.085186 0.074957 0.098443 0.119819 0.120728 0.113771 0.103780 0.115702
qa: -0.1912 -0.1046 -0.3646 0.6247 -0.3012 -0.3339 -0.1104 -0.1521 -0.1302 -0.2360 -0.1310 -0.1212 0.1121 0.1247 0.1214 0.0940 0.1010 0.0783 0.0878 0.0852 0.0750 0.0984 0.1198 0.1207 0.1138 0.1038 0.1157
va: 2.2708 2.2060 2.1023 5.4168 2.1141 2.0885 3.8713 3.9420 3.9833 3.9088 3.8763 3.8802 1.0103 1.0404 1.0325 1.0178 1.0044 1.0078 1.0136 1.0065 1.0046 1.0035 0.9891 0.9923 1.0020 0.9948 0.9917
dispcorr: -0.011012873 hartree
energy: -1924.231923812568
dipole: 12.52246 -12.53578 -0.01331 10.30684 -8.60993 1.69692 4.38966 -4.02612 0.36354
magnitude: 1.73547 au
magnitude: 4.41122 debye
