program: Orca
programVersion: 5.0.2
elementType: S S S P O O C C C C C C H H H H H H H H H H H H H H H
charge: 0
multiplicity: 1
keywords: wb97x-d3
keywords: def2-TZVPP
keywords: def2/J RIJCOSX
keywords: DEFGRID2
keywords: scfconv7
keywords: smallprint printgap noloewdin
keywords: NOSOSCF
formula: C6H15O2PS3
InChI: InChI=1/C6H15O2PS3/c1-4-11-5-6-12-9(10,7-2)8-3/h4-6H2,1-3H3
27 atoms
S  -0.828701 1.520127 -0.397247
S  3.517887 0.661025 -0.266822
S  -0.466172 -1.627953 0.880699
P  -1.681076 -0.255487 0.331701
O  -2.681048 0.345772 1.43883
O  -2.722348 -0.760518 -0.767352
C  0.845478 0.966906 -0.892844
C  1.848165 1.156316 0.229113
C  3.397577 -1.14407 -0.092285
C  4.716038 -1.773697 -0.50659
C  -2.165949 0.782791 2.689563
C  -3.714784 0.085809 -1.335629
H  1.110807 1.571719 -1.759309
H  0.791801 -0.072144 -1.213216
H  1.544388 0.59316 1.112576
H  1.907088 2.208131 0.512218
H  3.163386 -1.385528 0.945415
H  2.582417 -1.526807 -0.707436
H  5.540405 -1.41305 0.1083
H  4.666211 -2.85679 -0.395751
H  4.951427 -1.554865 -1.547844
H  -1.686146 -0.038893 3.222549
H  -3.010234 1.147154 3.269362
H  -1.445327 1.593315 2.559655
H  -3.274086 0.992516 -1.755558
H  -4.472048 0.359078 -0.600899
H  -4.183623 -0.479543 -2.137048
totalener: -1924.22141969 hartree
nucrepener: 1253.64524756 hartree
electener: -3177.86666725 hartree
oneelecener: -5146.40589511 hartree
twoeener: 1968.53922786 hartree
kineticenergy: 1919.65790441 hartree
xcener: -112.329820096230 hartree
chargesum: 0.0000000
charge: -0.195761 -0.122580 -0.381747 0.638134 -0.325217 -0.300169 -0.091078 -0.129280 -0.116109 -0.254273 -0.122832 -0.133419 0.119593 0.101223 0.090097 0.112952 0.090001 0.082428 0.089538 0.086690 0.087233 0.115746 0.117289 0.100895 0.103081 0.118066 0.119500
qa: -0.1958 -0.1226 -0.3817 0.6381 -0.3252 -0.3002 -0.0911 -0.1293 -0.1161 -0.2543 -0.1228 -0.1334 0.1196 0.1012 0.0901 0.1130 0.0900 0.0824 0.0895 0.0867 0.0872 0.1157 0.1173 0.1009 0.1031 0.1181 0.1195
va: 2.2665 2.2163 2.0751 5.4156 2.0823 2.1508 3.8362 3.9655 4.0086 3.9405 3.8806 3.8812 1.0220 1.0448 1.0427 1.0140 1.0004 1.0029 1.0081 1.0029 1.0089 0.9991 0.9934 0.9965 0.9994 0.9901 0.9900
dispcorr: -0.011036875 hartree
energy: -1924.232456568421
dipole: 9.02875 -9.80576 -0.77701 -0.77390 1.42730 0.65339 -0.41395 0.42143 0.00748
magnitude: 1.01525 au
magnitude: 2.58055 debye
