program: Orca
programVersion: 5.0.2
elementType: S S S P O O C C C C C C H H H H H H H H H H H H H H H
charge: 0
multiplicity: 1
keywords: wb97x-d3
keywords: def2-TZVPP
keywords: def2/J RIJCOSX
keywords: DEFGRID2
keywords: scfconv7
keywords: smallprint printgap noloewdin
keywords: NOSOSCF
formula: C6H15O2PS3
InChI: InChI=1/C6H15O2PS3/c1-4-11-5-6-12-9(10,7-2)8-3/h4-6H2,1-3H3
27 atoms
S  -0.766294 1.688023 -0.348545
S  3.483421 0.557383 -1.01488
S  -0.594578 -1.707356 0.175933
P  -1.569261 -0.064081 0.420384
O  -1.87799 0.336559 1.937004
O  -3.041268 -0.024846 -0.221745
C  1.025282 1.416444 -0.064986
C  1.693075 0.736931 -1.245191
C  3.612947 -1.08225 -0.242326
C  3.190054 -1.15605 1.213555
C  -2.282993 -0.653013 2.879512
C  -3.251006 -0.524189 -1.537446
H  1.161002 0.855912 0.857251
H  1.440029 2.410581 0.099571
H  1.552255 1.333881 -2.14728
H  1.249178 -0.241546 -1.429838
H  3.056171 -1.799322 -0.847962
H  4.66894 -1.339591 -0.3437
H  2.113988 -1.030334 1.324744
H  3.439717 -2.134566 1.627922
H  3.695399 -0.396945 1.809501
H  -1.574647 -1.481566 2.910975
H  -3.275728 -1.03946 2.645432
H  -2.311762 -0.162678 3.849243
H  -2.688165 0.052384 -2.274359
H  -4.313414 -0.424682 -1.745102
H  -2.96065 -1.57287 -1.611373
totalener: -1924.22094209 hartree
nucrepener: 1269.66149336 hartree
electener: -3193.88243545 hartree
oneelecener: -5178.49898296 hartree
twoeener: 1984.61654751 hartree
kineticenergy: 1919.67529640 hartree
xcener: -112.331632939416 hartree
chargesum: -0.0000000
charge: -0.145207 -0.125792 -0.420836 0.645781 -0.309222 -0.327134 -0.108247 -0.144246 -0.118640 -0.234231 -0.131338 -0.119913 0.106375 0.122367 0.112395 0.097924 0.088334 0.100448 0.056418 0.087443 0.087605 0.111645 0.115095 0.118525 0.102549 0.117467 0.114435
qa: -0.1452 -0.1258 -0.4208 0.6458 -0.3092 -0.3271 -0.1082 -0.1442 -0.1186 -0.2342 -0.1313 -0.1199 0.1064 0.1224 0.1124 0.0979 0.0883 0.1004 0.0564 0.0874 0.0876 0.1116 0.1151 0.1185 0.1025 0.1175 0.1144
va: 2.2986 2.1986 2.0223 5.3990 2.1218 2.1035 3.8721 3.9588 3.9824 3.8683 3.8776 3.8748 1.0312 1.0188 1.0144 1.0427 1.0107 1.0028 1.0421 1.0102 1.0146 1.0026 0.9892 0.9897 0.9948 0.9920 1.0023
dispcorr: -0.011880245 hartree
energy: -1924.232822339956
dipole: 6.51907 -7.18683 -0.66776 -6.39054 6.13749 -0.25305 3.09410 -2.83326 0.26085
magnitude: 0.76025 au
magnitude: 1.93239 debye
