program: Orca
programVersion: 5.0.2
elementType: S S S P O O C C C C C C H H H H H H H H H H H H H H H
charge: 0
multiplicity: 1
keywords: wb97x-d3
keywords: def2-TZVPP
keywords: def2/J RIJCOSX
keywords: DEFGRID2
keywords: scfconv7
keywords: smallprint printgap noloewdin
keywords: NOSOSCF
formula: C6H15O2PS3
InChI: InChI=1/C6H15O2PS3/c1-4-11-5-6-12-9(10,7-2)8-3/h4-6H2,1-3H3
27 atoms
S  -0.510587 1.574115 -0.318463
S  2.290774 0.283958 -1.614296
S  -0.801234 -0.268371 2.52547
P  -1.304611 -0.08301 0.688747
O  -2.862985 0.122673 0.352733
O  -0.961956 -1.378727 -0.176978
C  1.133228 1.675514 0.459636
C  2.049212 0.504035 0.168628
C  3.349793 -1.189739 -1.58851
C  2.602782 -2.475216 -1.279103
C  -3.636797 1.055155 1.096777
C  -1.164425 -1.440585 -1.587391
H  0.993365 1.775544 1.536475
H  1.557194 2.607251 0.082624
H  1.647796 -0.403756 0.620216
H  3.014779 0.704068 0.640497
H  3.801191 -1.238569 -2.58047
H  4.167618 -1.025622 -0.883744
H  3.29194 -3.320813 -1.248324
H  2.092901 -2.432339 -0.317256
H  1.852723 -2.680073 -2.041756
H  -3.587001 0.84188 2.165191
H  -4.664037 0.955097 0.755035
H  -3.299021 2.078417 0.9218
H  -0.881351 -2.44539 -1.891595
H  -0.52875 -0.719575 -2.102204
H  -2.209458 -1.27336 -1.849286
totalener: -1924.22001324 hartree
nucrepener: 1302.60073918 hartree
electener: -3226.82075242 hartree
oneelecener: -5244.52095442 hartree
twoeener: 2017.70020201 hartree
kineticenergy: 1919.67581901 hartree
xcener: -112.336787719995 hartree
chargesum: 0.0000000
charge: -0.167968 -0.114471 -0.383789 0.634861 -0.335026 -0.301431 -0.147308 -0.135057 -0.106025 -0.247211 -0.122425 -0.160547 0.129501 0.125957 0.083093 0.107908 0.099454 0.083600 0.094963 0.089695 0.070783 0.113783 0.115911 0.104300 0.117114 0.115066 0.135269
qa: -0.1680 -0.1145 -0.3838 0.6349 -0.3350 -0.3014 -0.1473 -0.1351 -0.1060 -0.2472 -0.1224 -0.1605 0.1295 0.1260 0.0831 0.1079 0.0995 0.0836 0.0950 0.0897 0.0708 0.1138 0.1159 0.1043 0.1171 0.1151 0.1353
va: 2.2707 2.2141 2.0832 5.4124 2.0948 2.1017 3.9289 3.9851 3.9638 3.9108 3.8815 3.8575 1.0292 1.0087 1.0229 1.0044 1.0043 1.0098 1.0087 1.0066 1.0121 1.0021 0.9917 0.9942 0.9865 1.0056 0.9966
dispcorr: -0.012677648 hartree
energy: -1924.232690884601
dipole: 8.46081 -8.33610 0.12471 -6.11835 6.21395 0.09560 -6.65911 5.99668 -0.66243
magnitude: 0.68082 au
magnitude: 1.73050 debye
