program: Orca
programVersion: 5.0.2
elementType: S S S P O O C C C C C C H H H H H H H H H H H H H H H
charge: 0
multiplicity: 1
keywords: wb97x-d3
keywords: def2-TZVPP
keywords: def2/J RIJCOSX
keywords: DEFGRID2
keywords: scfconv7
keywords: smallprint printgap noloewdin
keywords: NOSOSCF
formula: C6H15O2PS3
InChI: InChI=1/C6H15O2PS3/c1-4-11-5-6-12-9(10,7-2)8-3/h4-6H2,1-3H3
27 atoms
S  -0.589747 1.468779 -0.73751
S  2.216646 0.732619 1.121432
S  -0.659809 -1.926348 -1.066945
P  -1.266725 -0.40352 -0.072136
O  -0.993822 -0.531091 1.489962
O  -2.848054 -0.104167 -0.083312
C  1.05478 1.093997 -1.417884
C  2.197056 1.510418 -0.507117
C  2.635223 -0.988356 0.721081
C  4.051495 -1.180219 0.212474
C  -1.221482 0.536922 2.403146
C  -3.562878 -0.122581 -1.311866
H  1.117204 1.64265 -2.359771
H  1.087855 0.031587 -1.66751
H  2.150546 2.582648 -0.310024
H  3.143955 1.333252 -1.02346
H  2.490098 -1.521671 1.661993
H  1.898244 -1.399476 0.029805
H  4.248093 -2.238739 0.034391
H  4.221276 -0.660691 -0.731336
H  4.783185 -0.813757 0.931595
H  -0.604176 1.399552 2.152735
H  -0.932875 0.168986 3.384483
H  -2.272942 0.825656 2.425193
H  -3.488319 -1.09865 -1.79269
H  -3.192809 0.641428 -1.99908
H  -4.603198 0.086433 -1.074244
totalener: -1924.22030225 hartree
nucrepener: 1314.62226646 hartree
electener: -3238.84256871 hartree
oneelecener: -5268.73309432 hartree
twoeener: 2029.89052561 hartree
kineticenergy: 1919.67584521 hartree
xcener: -112.338927441783 hartree
chargesum: 0.0000000
charge: -0.172267 -0.126081 -0.387456 0.647733 -0.292290 -0.338982 -0.115468 -0.162483 -0.104046 -0.240201 -0.138455 -0.122230 0.117255 0.112959 0.110232 0.100334 0.101008 0.083644 0.089479 0.069347 0.087105 0.102437 0.120426 0.127102 0.114166 0.101717 0.115018
qa: -0.1723 -0.1261 -0.3875 0.6477 -0.2923 -0.3390 -0.1155 -0.1625 -0.1040 -0.2402 -0.1385 -0.1222 0.1173 0.1130 0.1102 0.1003 0.1010 0.0836 0.0895 0.0693 0.0871 0.1024 0.1204 0.1271 0.1142 0.1017 0.1150
va: 2.2763 2.1924 2.0731 5.4045 2.1220 2.1004 3.8330 3.9908 3.9205 3.9380 3.8620 3.8828 1.0096 1.0466 1.0100 1.0081 1.0089 1.0525 1.0056 1.0048 1.0122 1.0061 0.9882 0.9929 1.0007 0.9971 0.9922
dispcorr: -0.012719869 hartree
energy: -1924.233022118303
dipole: 10.34757 -10.37345 -0.02588 1.40277 -0.56796 0.83481 -0.17106 -0.05076 -0.22182
magnitude: 0.86416 au
magnitude: 2.19652 debye
