program: Orca
programVersion: 5.0.2
elementType: S S S P O O C C C C C C H H H H H H H H H H H H H H H
charge: 0
multiplicity: 1
keywords: wb97x-d3
keywords: def2-TZVPP
keywords: def2/J RIJCOSX
keywords: DEFGRID2
keywords: scfconv7
keywords: smallprint printgap noloewdin
keywords: NOSOSCF
formula: C6H15O2PS3
InChI: InChI=1/C6H15O2PS3/c1-4-11-5-6-12-9(10,7-2)8-3/h4-6H2,1-3H3
27 atoms
S  -0.735834 1.56721 0.01472
S  3.442868 0.558481 -1.096595
S  -0.585719 -1.836181 -0.257683
P  -1.586937 -0.319943 0.346166
O  -1.946088 -0.403839 1.898862
O  -3.038855 -0.081676 -0.299556
C  1.050056 1.178085 0.156452
C  1.666304 0.898066 -1.198951
C  3.452709 -1.112473 -0.367584
C  3.760508 -1.133165 1.119102
C  -2.70277 0.597314 2.569866
C  -3.214925 -0.153141 -1.70911
H  1.169141 0.332527 0.831582
H  1.511658 2.04618 0.625725
H  1.565925 1.769081 -1.848435
H  1.157222 0.065285 -1.684925
H  2.489162 -1.580419 -0.576766
H  4.204494 -1.680708 -0.916641
H  2.999807 -0.609616 1.696387
H  3.804357 -2.160834 1.483776
H  4.718615 -0.660372 1.331222
H  -2.653138 0.365599 3.630942
H  -3.744544 0.586771 2.249612
H  -2.284013 1.592181 2.404855
H  -4.275203 -0.008837 -1.901303
H  -2.904047 -1.125703 -2.092417
H  -2.648651 0.629202 -2.218765
totalener: -1924.22012768 hartree
nucrepener: 1265.52116817 hartree
electener: -3189.74129584 hartree
oneelecener: -5170.12059643 hartree
twoeener: 1980.37930058 hartree
kineticenergy: 1919.66489842 hartree
xcener: -112.330594955010 hartree
chargesum: 0.0000000
charge: -0.193715 -0.132234 -0.386369 0.647036 -0.300245 -0.330299 -0.083603 -0.143636 -0.111839 -0.235021 -0.131000 -0.122745 0.088594 0.121793 0.106113 0.099129 0.085925 0.103325 0.071143 0.086300 0.085271 0.119158 0.117673 0.103264 0.116431 0.115689 0.103862
qa: -0.1937 -0.1322 -0.3864 0.6470 -0.3002 -0.3303 -0.0836 -0.1436 -0.1118 -0.2350 -0.1310 -0.1227 0.0886 0.1218 0.1061 0.0991 0.0859 0.1033 0.0711 0.0863 0.0853 0.1192 0.1177 0.1033 0.1164 0.1157 0.1039
va: 2.2668 2.1890 2.0675 5.4017 2.1426 2.0866 3.8294 4.0008 3.9235 3.9441 3.8768 3.8830 1.0513 1.0205 1.0150 1.0388 1.0293 1.0065 1.0085 1.0076 1.0079 0.9898 0.9904 1.0019 0.9923 0.9998 0.9943
dispcorr: -0.011667027 hartree
energy: -1924.231794704265
dipole: 6.48032 -7.36412 -0.88381 0.15292 0.50667 0.65960 2.40870 -2.13619 0.27251
magnitude: 1.13598 au
magnitude: 2.88742 debye
