program: Orca
programVersion: 5.0.2
elementType: S S S P O O C C C C C C H H H H H H H H H H H H H H H
charge: 0
multiplicity: 1
keywords: wb97x-d3
keywords: def2-TZVPP
keywords: def2/J RIJCOSX
keywords: DEFGRID2
keywords: scfconv7
keywords: smallprint printgap noloewdin
keywords: NOSOSCF
formula: C6H15O2PS3
InChI: InChI=1/C6H15O2PS3/c1-4-11-5-6-12-9(10,7-2)8-3/h4-6H2,1-3H3
27 atoms
S  -0.790012 1.42236 -0.620056
S  3.576758 0.832186 -0.086531
S  -0.376743 -1.670249 0.779749
P  -1.613276 -0.331017 0.196505
O  -2.606895 0.290695 1.298127
O  -2.662748 -0.885811 -0.869927
C  0.937638 0.91468 -0.954457
C  1.835717 1.219324 0.22764
C  3.594167 -0.982523 0.082923
C  3.549479 -1.731874 -1.236371
C  -2.07552 0.823321 2.50366
C  -3.674585 -0.072549 -1.451663
H  1.245945 1.475251 -1.836534
H  0.947488 -0.144098 -1.205315
H  1.493838 0.682052 1.113108
H  1.805586 2.285412 0.458326
H  4.51152 -1.223254 0.622017
H  2.763292 -1.272287 0.728365
H  3.628056 -2.806899 -1.064793
H  2.61799 -1.551362 -1.771269
H  4.370284 -1.434499 -1.888128
H  -2.917845 1.180508 3.090977
H  -1.400273 1.658492 2.303204
H  -1.539359 0.057877 3.066496
H  -4.170579 -0.683942 -2.201196
H  -3.248019 0.806218 -1.93995
H  -4.406534 0.24504 -0.709129
totalener: -1924.21984401 hartree
nucrepener: 1265.53292612 hartree
electener: -3189.75277013 hartree
oneelecener: -5170.11526730 hartree
twoeener: 1980.36249717 hartree
kineticenergy: 1919.66130312 hartree
xcener: -112.329523797843 hartree
chargesum: -0.0000000
charge: -0.199801 -0.129181 -0.382551 0.642416 -0.323582 -0.300420 -0.072987 -0.150027 -0.114662 -0.234577 -0.123999 -0.135435 0.121410 0.092190 0.091021 0.109217 0.104327 0.084518 0.086107 0.073971 0.085526 0.118304 0.100610 0.115642 0.120108 0.103073 0.118781
qa: -0.1998 -0.1292 -0.3826 0.6424 -0.3236 -0.3004 -0.0730 -0.1500 -0.1147 -0.2346 -0.1240 -0.1354 0.1214 0.0922 0.0910 0.1092 0.1043 0.0845 0.0861 0.0740 0.0855 0.1183 0.1006 0.1156 0.1201 0.1031 0.1188
va: 2.2682 2.1931 2.0709 5.4057 2.0823 2.1551 3.8083 4.0094 3.9326 3.9397 3.8795 3.8837 1.0205 1.0584 1.0380 1.0140 1.0054 1.0237 1.0073 1.0084 1.0088 0.9941 0.9962 0.9986 0.9900 0.9978 0.9899
dispcorr: -0.011781272 hartree
energy: -1924.231625282078
dipole: 6.70756 -7.52246 -0.81490 -0.42516 1.07562 0.65046 -1.54682 1.51089 -0.03593
magnitude: 1.04329 au
magnitude: 2.65183 debye
