program: Orca
programVersion: 5.0.2
elementType: S S S P O O C C C C C C H H H H H H H H H H H H H H H
charge: 0
multiplicity: 1
keywords: wb97x-d3
keywords: def2-TZVPP
keywords: def2/J RIJCOSX
keywords: DEFGRID2
keywords: scfconv7
keywords: smallprint printgap noloewdin
keywords: NOSOSCF
formula: C6H15O2PS3
InChI: InChI=1/C6H15O2PS3/c1-4-11-5-6-12-9(10,7-2)8-3/h4-6H2,1-3H3
27 atoms
S  0.098799 0.99738 0.55542
S  2.421885 -0.546639 -1.403674
S  -1.836667 -1.770967 0.90912
P  -1.754431 0.048193 0.292487
O  -2.788637 1.091367 0.926033
O  -2.139478 0.328943 -1.231753
C  1.172068 -0.355044 1.124424
C  1.653171 -1.305456 0.041242
C  3.858086 0.267108 -0.652148
C  4.743137 0.83469 -1.748989
C  -2.892695 1.184549 2.339769
C  -1.430845 -0.345084 -2.263756
H  0.645764 -0.918994 1.895624
H  2.009644 0.152256 1.605322
H  0.810076 -1.885458 -0.336144
H  2.346207 -2.021258 0.491918
H  3.530464 1.068105 0.012845
H  4.410082 -0.461978 -0.054925
H  5.614958 1.324325 -1.315385
H  5.095593 0.050985 -2.418569
H  4.209086 1.574035 -2.345133
H  -3.171312 0.22651 2.781206
H  -3.668226 1.916861 2.548719
H  -1.953517 1.523357 2.78305
H  -0.374763 -0.063465 -2.265966
H  -1.882128 -0.038064 -3.203672
H  -1.519004 -1.428229 -2.160665
totalener: -1924.22038428 hartree
nucrepener: 1277.26819937 hartree
electener: -3201.48858365 hartree
oneelecener: -5193.71194338 hartree
twoeener: 1992.22335973 hartree
kineticenergy: 1919.67591990 hartree
xcener: -112.337069842102 hartree
chargesum: 0.0000000
charge: -0.155763 -0.099737 -0.403417 0.628435 -0.308265 -0.295869 -0.136831 -0.161906 -0.121933 -0.254503 -0.125070 -0.129600 0.127563 0.120161 0.107131 0.108939 0.078956 0.088782 0.084362 0.091395 0.091942 0.113749 0.118477 0.098896 0.102609 0.120085 0.111413
qa: -0.1558 -0.0997 -0.4034 0.6284 -0.3083 -0.2959 -0.1368 -0.1619 -0.1219 -0.2545 -0.1251 -0.1296 0.1276 0.1202 0.1071 0.1089 0.0790 0.0888 0.0844 0.0914 0.0919 0.1137 0.1185 0.0989 0.1026 0.1201 0.1114
va: 2.2962 2.2194 2.0509 5.4186 2.1305 2.1345 3.8470 3.9746 4.0052 3.9436 3.8754 3.8552 1.0389 0.9976 1.0327 1.0144 0.9977 0.9977 1.0036 1.0099 1.0068 0.9997 0.9936 0.9978 1.0130 0.9979 0.9993
dispcorr: -0.011524575 hartree
energy: -1924.231908853832
dipole: 17.09962 -16.11938 0.98024 1.70250 -1.29586 0.40664 -1.60463 2.10189 0.49727
magnitude: 1.17196 au
magnitude: 2.97890 debye
