program: Orca
programVersion: 5.0.2
elementType: S S S P O O C C C C C C H H H H H H H H H H H H H H H
charge: 0
multiplicity: 1
keywords: wb97x-d3
keywords: def2-TZVPP
keywords: def2/J RIJCOSX
keywords: DEFGRID2
keywords: scfconv7
keywords: smallprint printgap noloewdin
keywords: NOSOSCF
formula: C6H15O2PS3
InChI: InChI=1/C6H15O2PS3/c1-4-11-5-6-12-9(10,7-2)8-3/h4-6H2,1-3H3
27 atoms
S  -0.694936 1.650141 0.324177
S  3.180675 0.593678 -1.564465
S  -0.417222 -1.540168 1.497307
P  -1.489349 -0.276736 0.541939
O  -2.927708 0.102228 1.152324
O  -1.896508 -0.795851 -0.91337
C  1.081597 1.281374 0.109924
C  1.395679 0.666493 -1.242195
C  3.586644 -1.114064 -1.1033
C  3.470031 -1.427879 0.376373
C  -3.047314 0.441006 2.529336
C  -2.715305 -0.039589 -1.798303
H  1.404966 0.646386 0.933703
H  1.574759 2.247396 0.217958
H  0.952306 1.267734 -2.0369
H  0.975449 -0.337453 -1.325218
H  2.974406 -1.794288 -1.698172
H  4.615852 -1.242853 -1.443071
H  2.436966 -1.380806 0.718717
H  3.827716 -2.439335 0.575836
H  4.062771 -0.734243 0.970833
H  -2.695962 -0.373058 3.164234
H  -4.10254 0.620259 2.719225
H  -2.483121 1.345399 2.765865
H  -2.341297 0.979153 -1.917763
H  -3.747004 -0.005528 -1.448854
H  -2.681062 -0.543602 -2.760901
totalener: -1924.22157870 hartree
nucrepener: 1271.21731718 hartree
electener: -3195.43889588 hartree
oneelecener: -5181.52960883 hartree
twoeener: 1986.09071294 hartree
kineticenergy: 1919.66821967 hartree
xcener: -112.331574418023 hartree
chargesum: -0.0000000
charge: -0.183447 -0.125455 -0.375734 0.631549 -0.333369 -0.303973 -0.106460 -0.140737 -0.121296 -0.228607 -0.121442 -0.129806 0.114947 0.117965 0.113860 0.092218 0.088474 0.097078 0.066624 0.087090 0.083075 0.115632 0.115724 0.104426 0.098816 0.123086 0.119761
qa: -0.1834 -0.1255 -0.3757 0.6315 -0.3334 -0.3040 -0.1065 -0.1407 -0.1213 -0.2286 -0.1214 -0.1298 0.1149 0.1180 0.1139 0.0922 0.0885 0.0971 0.0666 0.0871 0.0831 0.1156 0.1157 0.1044 0.0988 0.1231 0.1198
va: 2.2783 2.2008 2.0898 5.4073 2.0893 2.1086 3.8886 3.9333 3.9866 3.8781 3.8792 3.8694 1.0385 1.0167 1.0166 1.0355 1.0092 1.0040 1.0335 1.0116 1.0147 1.0006 0.9917 0.9948 1.0049 0.9925 0.9891
dispcorr: -0.012107826 hartree
energy: -1924.233686525262
dipole: 6.04541 -6.80806 -0.76265 -1.35733 1.86250 0.50517 -1.80235 1.65501 -0.14734
magnitude: 0.92658 au
magnitude: 2.35517 debye
