program: Orca
programVersion: 5.0.2
elementType: S S S P O O C C C C C C H H H H H H H H H H H H H H H
charge: 0
multiplicity: 1
keywords: wb97x-d3
keywords: def2-TZVPP
keywords: def2/J RIJCOSX
keywords: DEFGRID2
keywords: scfconv7
keywords: smallprint printgap noloewdin
keywords: NOSOSCF
formula: C6H15O2PS3
InChI: InChI=1/C6H15O2PS3/c1-4-11-5-6-12-9(10,7-2)8-3/h4-6H2,1-3H3
27 atoms
S  -0.729728 1.414185 -1.042871
S  3.49252 0.778539 0.207562
S  -0.62341 -1.733511 0.291487
P  -1.539834 -0.042661 0.198396
O  -1.722766 0.738463 1.581951
O  -3.061785 -0.095625 -0.310805
C  1.028253 0.913558 -1.051577
C  1.740064 1.23431 0.247412
C  3.391718 -1.038845 0.313886
C  3.591337 -1.743752 -1.015763
C  -2.192005 0.044345 2.73654
C  -3.397844 -0.825184 -1.483285
H  1.473482 1.461327 -1.882269
H  1.070383 -0.149269 -1.284901
H  1.259541 0.735849 1.090515
H  1.705913 2.306346 0.445456
H  4.158481 -1.347903 1.02535
H  2.427752 -1.300069 0.754671
H  3.572834 -2.82626 -0.878386
H  2.809047 -1.487088 -1.728561
H  4.547705 -1.478235 -1.464503
H  -3.250671 -0.200554 2.643039
H  -2.053728 0.71456 3.581025
H  -1.624674 -0.872115 2.905214
H  -4.476448 -0.753231 -1.599535
H  -3.110002 -1.873402 -1.392198
H  -2.914845 -0.397848 -2.364418
totalener: -1924.22215126 hartree
nucrepener: 1271.81879739 hartree
electener: -3196.04094865 hartree
oneelecener: -5182.76287991 hartree
twoeener: 1986.72193126 hartree
kineticenergy: 1919.67885759 hartree
xcener: -112.332043317134 hartree
chargesum: -0.0000000
charge: -0.145241 -0.131789 -0.417044 0.637287 -0.310111 -0.330037 -0.105521 -0.135315 -0.106046 -0.238668 -0.129562 -0.120392 0.121422 0.101523 0.092916 0.110365 0.103872 0.078049 0.085545 0.074049 0.086576 0.117632 0.118739 0.108895 0.117314 0.113855 0.101686
qa: -0.1452 -0.1318 -0.4170 0.6373 -0.3101 -0.3300 -0.1055 -0.1353 -0.1060 -0.2387 -0.1296 -0.1204 0.1214 0.1015 0.0929 0.1104 0.1039 0.0780 0.0855 0.0740 0.0866 0.1176 0.1187 0.1089 0.1173 0.1139 0.1017
va: 2.3143 2.1871 2.0296 5.3934 2.1071 2.1058 3.8449 3.9855 3.9114 3.9447 3.8709 3.8767 1.0170 1.0547 1.0332 1.0172 1.0065 1.0380 1.0071 1.0089 1.0078 0.9908 0.9895 1.0045 0.9916 1.0016 0.9961
dispcorr: -0.011827516 hartree
energy: -1924.233978778036
dipole: 6.49366 -7.27397 -0.78031 -6.92690 6.69926 -0.22763 -0.59515 0.57923 -0.01592
magnitude: 0.81299 au
magnitude: 2.06647 debye
