program: Orca
programVersion: 5.0.2
elementType: S S S P O O C C C C C C H H H H H H H H H H H H H H H
charge: 0
multiplicity: 1
keywords: wb97x-d3
keywords: def2-TZVPP
keywords: def2/J RIJCOSX
keywords: DEFGRID2
keywords: scfconv7
keywords: smallprint printgap noloewdin
keywords: NOSOSCF
formula: C6H15O2PS3
InChI: InChI=1/C6H15O2PS3/c1-4-11-5-6-12-9(10,7-2)8-3/h4-6H2,1-3H3
27 atoms
S  -0.155584 1.474092 -0.21078
S  3.274535 -1.333463 -0.034432
S  -1.22439 -1.244214 1.585868
P  -1.699667 0.356296 0.634289
O  -2.475333 1.485211 1.456835
O  -2.716385 0.15606 -0.596546
C  1.332537 0.595132 0.387079
C  1.708564 -0.563479 -0.514984
C  4.473914 -0.087895 -0.590066
C  4.565955 0.063865 -2.097027
C  -3.546647 1.129748 2.326749
C  -2.457489 -0.853847 -1.558962
H  1.172664 0.25997 1.410722
H  2.106117 1.363502 0.401749
H  1.7418 -0.253186 -1.560458
H  0.956499 -1.349165 -0.432417
H  4.267567 0.870374 -0.109449
H  5.427346 -0.4302 -0.184559
H  4.816857 -0.883914 -2.570179
H  3.629501 0.415471 -2.529371
H  5.334941 0.791342 -2.361314
H  -3.243601 0.34877 3.025318
H  -4.417606 0.791004 1.76464
H  -3.806793 2.027527 2.88147
H  -2.425522 -1.841709 -1.096807
H  -1.512609 -0.672051 -2.077485
H  -3.268674 -0.817546 -2.281956
totalener: -1924.22054609 hartree
nucrepener: 1244.71723266 hartree
electener: -3168.93777875 hartree
oneelecener: -5128.55909788 hartree
twoeener: 1959.62131913 hartree
kineticenergy: 1919.67924179 hartree
xcener: -112.332501078046 hartree
chargesum: -0.0000000
charge: -0.149551 -0.104357 -0.401800 0.622947 -0.313686 -0.313237 -0.097530 -0.172319 -0.134276 -0.237249 -0.133477 -0.121160 0.120616 0.115213 0.098855 0.114765 0.081019 0.101579 0.088369 0.075008 0.086489 0.110915 0.115181 0.117722 0.115397 0.095447 0.119120
qa: -0.1496 -0.1044 -0.4018 0.6229 -0.3137 -0.3132 -0.0975 -0.1723 -0.1343 -0.2372 -0.1335 -0.1212 0.1206 0.1152 0.0989 0.1148 0.0810 0.1016 0.0884 0.0750 0.0865 0.1109 0.1152 0.1177 0.1154 0.0954 0.1191
va: 2.2931 2.2128 2.0509 5.4127 2.1384 2.0886 3.8267 3.9812 3.9860 3.9040 3.8838 3.8794 1.0441 1.0143 1.0117 1.0338 1.0074 1.0043 1.0140 1.0036 1.0064 1.0009 0.9887 0.9895 1.0012 0.9933 0.9941
dispcorr: -0.010919524 hartree
energy: -1924.231465617183
dipole: 11.02583 -11.13664 -0.11081 0.00308 0.55025 0.55334 -8.41156 7.77334 -0.63822
magnitude: 0.85193 au
magnitude: 2.16543 debye
