program: Orca
programVersion: 5.0.2
elementType: S S S P O O C C C C C C H H H H H H H H H H H H H H H
charge: 0
multiplicity: 1
keywords: wb97x-d3
keywords: def2-TZVPP
keywords: def2/J RIJCOSX
keywords: DEFGRID2
keywords: scfconv7
keywords: smallprint printgap noloewdin
keywords: NOSOSCF
formula: C6H15O2PS3
InChI: InChI=1/C6H15O2PS3/c1-4-11-5-6-12-9(10,7-2)8-3/h4-6H2,1-3H3
27 atoms
S  -0.599079 1.514476 -1.01411
S  2.10673 0.536022 0.994725
S  -0.718569 -1.866944 -0.482923
P  -1.366439 -0.127608 0.031107
O  -1.303816 0.268758 1.569971
O  -2.932813 0.135193 -0.212971
C  1.038884 0.953517 -1.560571
C  2.155483 1.356235 -0.614559
C  2.770829 -1.100543 0.577078
C  4.259102 -1.103947 0.280735
C  -0.836503 -0.582503 2.605455
C  -3.513434 -0.170937 -1.471942
H  1.188673 1.426076 -2.533704
H  1.002164 -0.124714 -1.726759
H  2.107646 2.426189 -0.408844
H  3.122042 1.174606 -1.090851
H  2.554168 -1.716491 1.451429
H  2.187291 -1.528232 -0.239283
H  4.602185 -2.117478 0.06721
H  4.50368 -0.492807 -0.588456
H  4.830105 -0.721905 1.125661
H  -0.306287 -1.449248 2.210716
H  -1.684537 -0.92402 3.198907
H  -0.160501 -0.004645 3.23108
H  -4.569619 0.076766 -1.398766
H  -3.404884 -1.230598 -1.708323
H  -3.063746 0.419106 -2.273419
totalener: -1924.21909125 hartree
nucrepener: 1313.92717570 hartree
electener: -3238.14626694 hartree
oneelecener: -5267.43145764 hartree
twoeener: 2029.28519070 hartree
kineticenergy: 1919.68682906 hartree
xcener: -112.342236135431 hartree
chargesum: 0.0000000
charge: -0.154474 -0.111039 -0.420335 0.646669 -0.297692 -0.322354 -0.127461 -0.146681 -0.116605 -0.239721 -0.120523 -0.121557 0.115935 0.111219 0.110304 0.098876 0.097582 0.089414 0.087316 0.071914 0.087326 0.097672 0.123524 0.115828 0.115733 0.111336 0.097795
qa: -0.1545 -0.1110 -0.4203 0.6467 -0.2977 -0.3224 -0.1275 -0.1467 -0.1166 -0.2397 -0.1205 -0.1216 0.1159 0.1112 0.1103 0.0989 0.0976 0.0894 0.0873 0.0719 0.0873 0.0977 0.1235 0.1158 0.1157 0.1113 0.0978
va: 2.2924 2.2140 2.0260 5.4258 2.1157 2.1214 3.8682 3.9726 3.9466 3.9465 3.8674 3.8815 1.0095 1.0432 1.0144 1.0103 1.0059 1.0222 1.0054 1.0058 1.0117 1.0095 0.9953 0.9844 0.9924 1.0004 1.0000
dispcorr: -0.012336320 hartree
energy: -1924.231427567584
dipole: 13.31176 -12.82891 0.48285 -4.15217 4.18476 0.03259 -0.83002 0.43032 -0.39970
magnitude: 0.62767 au
magnitude: 1.59540 debye
