program: Orca
programVersion: 5.0.2
elementType: S S S P O O C C C C C C H H H H H H H H H H H H H H H
charge: 0
multiplicity: 1
keywords: wb97x-d3
keywords: def2-TZVPP
keywords: def2/J RIJCOSX
keywords: DEFGRID2
keywords: scfconv7
keywords: smallprint printgap noloewdin
keywords: NOSOSCF
formula: C6H15O2PS3
InChI: InChI=1/C6H15O2PS3/c1-4-11-5-6-12-9(10,7-2)8-3/h4-6H2,1-3H3
27 atoms
S  -0.112821 1.545425 -0.141587
S  3.287466 0.890724 -0.430419
S  -0.94497 -1.761248 -0.577709
P  -1.4737 -0.009841 0.022597
O  -1.874026 0.109734 1.574711
O  -2.776407 0.594574 -0.680305
C  0.77524 1.103914 -1.676239
C  1.970439 0.197649 -1.462138
C  2.876393 0.346952 1.25678
C  2.67013 -1.146671 1.419981
C  -1.084398 -0.52639 2.570175
C  -3.926394 -0.223457 -0.884295
H  1.085396 2.062534 -2.09179
H  0.071979 0.653227 -2.378166
H  2.43284 0.015521 -2.435491
H  1.654199 -0.77442 -1.088237
H  3.741128 0.673019 1.837807
H  2.015968 0.903815 1.624793
H  2.569167 -1.395769 2.477947
H  1.763605 -1.491554 0.922411
H  3.513224 -1.708424 1.020348
H  -0.093726 -0.072128 2.639545
H  -0.971526 -1.591819 2.365162
H  -1.602004 -0.391228 3.516745
H  -3.672523 -1.130684 -1.43368
H  -4.628245 0.368192 -1.466294
H  -4.390627 -0.49709 0.063978
totalener: -1924.21869130 hartree
nucrepener: 1300.56429996 hartree
electener: -3224.78299125 hartree
oneelecener: -5240.28921014 hartree
twoeener: 2015.50621889 hartree
kineticenergy: 1919.68758736 hartree
xcener: -112.337824341441 hartree
chargesum: -0.0000000
charge: -0.124449 -0.125490 -0.415646 0.632687 -0.323244 -0.309867 -0.119747 -0.141144 -0.130207 -0.258580 -0.120451 -0.134117 0.119591 0.113079 0.109768 0.105457 0.105502 0.082854 0.087759 0.068647 0.099277 0.095923 0.114875 0.122304 0.112404 0.118081 0.114735
qa: -0.1244 -0.1255 -0.4156 0.6327 -0.3232 -0.3099 -0.1197 -0.1411 -0.1302 -0.2586 -0.1205 -0.1341 0.1196 0.1131 0.1098 0.1055 0.1055 0.0829 0.0878 0.0686 0.0993 0.0959 0.1149 0.1223 0.1124 0.1181 0.1147
va: 2.3153 2.1904 2.0279 5.4049 2.0974 2.1280 3.8828 3.9521 3.9745 3.8875 3.8879 3.8807 1.0159 1.0277 1.0093 1.0316 1.0035 1.0166 1.0038 1.0261 1.0196 0.9832 1.0017 0.9937 1.0021 0.9901 0.9887
dispcorr: -0.013064434 hartree
energy: -1924.231755732908
dipole: 4.75677 -5.39634 -0.63957 -5.44944 5.32890 -0.12054 5.33801 -4.97365 0.36437
magnitude: 0.74588 au
magnitude: 1.89589 debye
