program: Orca
programVersion: 5.0.2
elementType: S S S P O O C C C C C C H H H H H H H H H H H H H H H
charge: 0
multiplicity: 1
keywords: wb97x-d3
keywords: def2-TZVPP
keywords: def2/J RIJCOSX
keywords: DEFGRID2
keywords: scfconv7
keywords: smallprint printgap noloewdin
keywords: NOSOSCF
formula: C6H15O2PS3
InChI: InChI=1/C6H15O2PS3/c1-4-11-5-6-12-9(10,7-2)8-3/h4-6H2,1-3H3
27 atoms
S  -0.262207 1.539663 0.404987
S  3.129951 -1.08178 -0.754557
S  -1.449243 -1.617975 0.915065
P  -1.776548 0.131393 0.189592
O  -3.043859 0.922684 0.783016
O  -2.092267 0.208407 -1.377726
C  1.21313 0.465101 0.506381
C  1.567917 -0.170479 -0.824123
C  4.317974 0.287746 -0.851421
C  5.72468 -0.272599 -0.97254
C  -3.259724 0.960508 2.187658
C  -3.067548 -0.660268 -1.949378
H  1.048512 -0.291604 1.272542
H  2.001109 1.134202 0.854391
H  1.61007 0.575971 -1.619474
H  0.806136 -0.900185 -1.101454
H  4.0781 0.904076 -1.720257
H  4.24216 0.919338 0.035532
H  6.450755 0.538413 -1.02691
H  5.98119 -0.89223 -0.113641
H  5.830962 -0.880066 -1.870574
H  -2.450063 1.486193 2.697746
H  -3.345487 -0.044873 2.601014
H  -4.189705 1.499846 2.348819
H  -2.874406 -1.700546 -1.683566
H  -2.994111 -0.543693 -3.02768
H  -4.07351 -0.387308 -1.628149
totalener: -1924.22215766 hartree
nucrepener: 1238.54445640 hartree
electener: -3162.76661405 hartree
oneelecener: -5116.31489869 hartree
twoeener: 1953.54828464 hartree
kineticenergy: 1919.67300013 hartree
xcener: -112.330527679255 hartree
chargesum: 0.0000000
charge: -0.146960 -0.105480 -0.399787 0.619195 -0.332259 -0.308927 -0.122548 -0.122089 -0.130946 -0.251753 -0.118872 -0.126346 0.124598 0.111033 0.097200 0.110169 0.085669 0.079169 0.084110 0.090151 0.091596 0.102007 0.113402 0.116252 0.108831 0.117395 0.115188
qa: -0.1470 -0.1055 -0.3998 0.6192 -0.3323 -0.3089 -0.1225 -0.1221 -0.1309 -0.2518 -0.1189 -0.1263 0.1246 0.1110 0.0972 0.1102 0.0857 0.0792 0.0841 0.0902 0.0916 0.1020 0.1134 0.1163 0.1088 0.1174 0.1152
va: 2.3081 2.2222 2.0513 5.4143 2.1006 2.1013 3.8789 3.9329 4.0228 3.9339 3.8751 3.8720 1.0396 1.0104 1.0228 1.0349 0.9977 0.9958 1.0034 1.0075 1.0101 0.9956 1.0037 0.9917 1.0044 0.9894 0.9905
dispcorr: -0.010320778 hartree
energy: -1924.232478433615
dipole: 12.92120 -13.07957 -0.15837 1.59684 -0.73494 0.86190 -3.27018 3.16315 -0.10703
magnitude: 0.88284 au
magnitude: 2.24399 debye
