program: Gaussian 09
title: 000066857
version: EM64L-G09RevD.01
frameworkgroup: C1[X(C8H8N2O3)]
method: RPBEPBE
basis: SDD
operation: Freq
keyword: #pfreq=noraman
keyword: PBEPBE/SDD
title: #p freq=noraman PBEPBE/SDD
converged: NO YES NO NO
title: Mulliken charges:
elementType: O O O N N C C C C C C C C H H H H H H H H
charge: -0.203574 -0.358085 -0.249026 -0.456052 -0.706741 0.552876 -0.642862 0.553641 -0.397657 -0.446840 -0.174782 0.118026 0.095244 0.218138 0.301801 0.219807 0.223406 0.345520 0.309330 0.306888 0.390943
chargesum: 0.00000
title: Mulliken charges with hydrogens summed into heavy atoms:
elementType: O O O N N C C C C C C C C
charge: -0.203574 0.032857 -0.249026 -0.110533 -0.090522 0.552876 -0.424724 0.553641 -0.095856 -0.227033 0.048623 0.118026 0.095244
polarizability: 2.01157253e+02 6.95805534e+00 1.22265887e+02 1.49168933e-02 -1.05333147e-02 4.54821197e+01
1716.lowfreq: -0.0010 -0.0009 -0.0008 2.0245 10.3025 14.1703 47.2525 65.2541 95.1820
frequency: 47.2229 65.1618 95.1656 108.0178 221.3017 235.3283 253.2590 266.1568 334.2969 363.9576 368.3018 411.8935 436.2404 473.2048 504.6847 522.8103 579.9751 615.5859 641.1259 653.5610 691.4852 756.3847 761.9807 773.6762 794.8669 862.2512 874.6881 890.5128 945.0601 979.2876 980.7138 1035.0811 1068.1694 1106.0473 1149.1915 1181.6845 1225.8637 1318.5165 1324.0534 1344.0559 1399.6867 1439.2497 1496.9702 1531.5356 1596.2098 1610.0504 1632.6259 1634.2263 1646.7341 3109.8715 3125.8775 3150.8864 3206.1627 3458.3318 3508.0567 3570.4953 3709.9795
redmass: 7.4682 6.5211 7.3618 6.3907 3.6668 7.5310 4.5045 5.8160 9.0680 1.1690 1.0904 3.2579 3.1469 3.2660 9.1872 6.2478 6.1023 3.7928 1.3342 4.8761 1.8121 1.8084 6.5469 2.7293 1.3618 1.9798 6.9164 1.4180 3.0091 6.1422 1.3170 1.6781 2.2152 1.4651 2.4886 1.0877 1.6711 1.4168 2.4919 3.2264 8.2140 2.6572 3.0406 2.3303 6.0713 5.9771 9.2503 2.9649 1.4489 1.0913 1.0874 1.0959 1.0950 1.0762 1.0642 1.0451 1.1039
irintensity: 0.4110 3.4491 1.5091 1.1412 7.2483 5.6584 2.7115 2.7940 2.5368 216.6115 100.0470 5.1827 0.3524 10.7446 16.2356 1.7686 71.2226 6.0919 149.2571 38.2036 27.3870 68.7458 2.2390 28.1509 15.7421 105.1174 3.8182 15.1996 4.5268 6.2404 5.1951 41.7244 335.4649 24.0633 28.0197 12.4843 7.7687 36.0347 118.9970 16.2289 36.2622 79.4329 103.1369 37.0738 86.7133 179.3956 300.7463 30.9323 258.9931 14.3555 13.1140 26.0406 6.3837 44.6720 63.6616 71.6456 21.2198
temp: 298.150 k
press: 1.00000 atm
elementType: 8 8 8 7 7 6 6 6 6 6 6 6 6 1 1 1 1 1 1 1 1
symmnumber: 1
zpe: 407255.3 jmol-1
zpe.correction: 0.155115 hartree
zpe.thermalcorrener: 0.166918 hartree
zpe.thermalcorrenthalpy: 0.167862 hartree
zpe.thermalcorrgfe: 0.116736 hartree
zpe.sumelectzpe: -643.908592 hartree
zpe.sumelectthermal: -643.896789 hartree
zpe.sumelectthermalent: -643.895845 hartree
zpe.sumelectthermalfe: -643.946971 hartree
dipole: -2.8061 -3.6981 0.0002
dipole: 4.6422
quadrupole: -48.4967 -74.6632 -79.1927
quadrupole: -0.5505 0.0119 0.0043
quadrupole: 18.9542 -7.2124 -11.7419 -0.5505 0.0119 0.0043
hfenergy: -644.0637075 hartree
pointgroup: C01 [X(C8H8N2O3)]
dipole: -1.1001947 -1.4578231 0.0000859 debye
dipolederiv: -0.5192366 0.0162421 -0.0000293 -0.7834412 -0.7605197 -0.0001921 0.000683 0.0003449 -0.3215654 -1.3788445 -0.4166171 0.0000025 -0.4012539 -0.3557291 -0.0000305 -0.0014261 -0.0005758 -0.3852268 -0.8637308 0.1123458 -0.0001402 0.2192887 -0.9461957 -0.000575 -0.0010435 0.0013135 -0.3176699 -1.1051688 -0.2253169 0.0000964 -0.1630068 -0.4257184 0.0000814 0.0011412 -0.0001249 -0.2899505 -0.9063076 -0.6623718 0.0000535 -0.860444 -0.7658866 0.000032 0.000263 0.0001526 -0.7589024 0.7012903 0.1095991 0.0000174 -0.1763374 0.3379107 -0.0000461 -0.0001428 -0.0000142 0.1411058 -0.437131 -0.4013301 0.0000049 0.0505655 -0.0625259 0.0000111 -0.0002681 0.00001 -0.3011283 0.9115612 0.7712622 -0.0000059 1.0872506 0.7725401 -0.0000146 -0.0000073 0.000003 0.1744779 -0.3637723 0.034197 0.0000083 0.0368347 -0.27633 0.00001 0.0000629 -0.0000507 -0.233768 -0.1109172 0.0074943 -0.0000036 -0.4806634 -0.3172614 -0.0000148 -0.0000215 0.0000094 -0.2565817 0.3012729 -0.0434714 0.0000279 0.0188472 0.2052027 -0.0000068 0.0001658 -0.0000471 -0.1078861 0.6849622 0.2732967 -0.0002549 1.0867033 0.9213471 0.0003341 -0.0014672 -0.0002692 0.2174446 2.0409434 0.1917443 0.0004336 0.0521092 1.0804619 0.0002431 0.0027525 -0.0009759 0.2381807 0.0474482 0.0597556 -0.0000108 0.0421288 -0.1052944 0.0000036 -0.0000228 0.0000066 0.1852459 0.0997797 -0.0581256 -0.0000093 -0.0284601 0.0788147 -0.0000015 -0.0001487 0.0000652 0.197879 -0.1499837 0.0409187 -0.0000155 0.0142946 0.0737634 0.0000026 -0.0000468 0.0000087 0.1760405 0.0581914 0.053613 -0.0000039 0.0792745 -0.10283 0.0000111 -0.0000172 0.0000092 0.1478495 0.2754862 -0.041521 0.000001 -0.0387869 0.1744781 0.0000273 0.0000479 0.0000401 0.3056583 0.2010033 0.0493522 -0.0000334 0.0473757 0.1449903 0.0000084 -0.0000883 -0.0000372 0.3905721 0.1440059 0.0432034 -0.0000027 0.0677766 0.1730819 -0.000023 -0.0000787 -0.0000947 0.3904547 0.3691479 0.0857296 -0.0001361 0.1299444 0.1557002 0.0001397 -0.0003372 0.0002264 0.40777 unknown
polarizability: 201.1202309|7.1647668|122.302909|0.0149445|-0.0104942|45.4821197 unknown
InChI: InChI=1S/C8H8N2O3/c9-5-2-1-3-6(4-5)10-7(11)8(12)13/h1-4,10,12H,9H2
charge 0 multiplicity 1
21 atoms
O  2.028402 1.65282 -0.000784
O  4.364318 0.168312 0.000652
O  3.112011 -1.78906 0.000842
N  0.797421 -0.377628 -0.0002
N  -3.902334 -1.630679 -0.000359
C  -0.559007 0.05009 -0.000244
C  -1.546245 -0.968416 -0.000294
C  -2.925754 -0.633912 -0.000395
C  -0.925452 1.422171 -0.000328
C  -3.296376 0.744339 -0.000433
C  -2.301086 1.738799 -0.000408
C  1.945864 0.394031 -0.00022
C  3.179186 -0.53204 -0.001015
H  -1.242241 -2.023757 -0.000259
H  -0.156057 2.194441 -0.000337
H  -4.357081 1.021734 -0.000469
H  -2.6019 2.792534 -0.000458
H  0.9733 -1.390664 -0.000119
H  -4.888459 -1.388797 -0.000537
H  -3.650514 -2.614358 -0.000499
H  5.130405 -0.469062 0.001864
