program: Orca
programVersion: 5.0.2
elementType: S S S P O O C C C C C C H H H H H H H H H H H H H H H
charge: 0
multiplicity: 1
keywords: wb97x-d3
keywords: def2-TZVPP
keywords: def2/J RIJCOSX
keywords: DEFGRID2
keywords: scfconv7
keywords: smallprint printgap noloewdin
keywords: NOSOSCF
formula: C6H15O2PS3
InChI: InChI=1/C6H15O2PS3/c1-4-11-5-6-12-9(10,7-2)8-3/h4-6H2,1-3H3
27 atoms
S  -0.215452 1.547007 -0.022783
S  3.114748 0.940761 -0.281734
S  -0.790758 -1.808707 -0.457719
P  -1.491391 -0.084575 0.036356
O  -2.054567 0.042637 1.536592
O  -2.75456 0.41318 -0.810312
C  0.669594 1.267679 -1.596898
C  1.893106 0.375618 -1.493193
C  2.781606 -0.172129 1.115845
C  3.210569 -1.607654 0.880026
C  -1.334872 -0.513315 2.628836
C  -3.814953 -0.486369 -1.121837
H  0.951742 2.270746 -1.917063
H  -0.030785 0.87847 -2.337671
H  2.38486 0.360322 -2.468447
H  1.599656 -0.649593 -1.273476
H  3.334355 0.263208 1.950155
H  1.722772 -0.114542 1.368434
H  3.028639 -2.208711 1.773071
H  2.647418 -2.065605 0.066827
H  4.270293 -1.668497 0.636379
H  -0.412479 0.040619 2.815596
H  -1.090559 -1.56137 2.450121
H  -1.976956 -0.433966 3.502769
H  -3.439769 -1.385314 -1.612247
H  -4.482504 0.043678 -1.796499
H  -4.366672 -0.771126 -0.225087
totalener: -1924.21908739 hartree
nucrepener: 1296.66907263 hartree
electener: -3220.88816002 hartree
oneelecener: -5232.62175541 hartree
twoeener: 2011.73359539 hartree
kineticenergy: 1919.67973809 hartree
xcener: -112.335538267985 hartree
chargesum: 0.0000000
charge: -0.121324 -0.132478 -0.422316 0.640123 -0.323503 -0.315855 -0.132293 -0.132102 -0.066362 -0.242735 -0.124392 -0.134615 0.120808 0.114863 0.109420 0.089281 0.099763 0.038691 0.080249 0.081455 0.087511 0.102049 0.114972 0.123084 0.112981 0.117844 0.114881
qa: -0.1213 -0.1325 -0.4223 0.6401 -0.3235 -0.3159 -0.1323 -0.1321 -0.0664 -0.2427 -0.1244 -0.1346 0.1208 0.1149 0.1094 0.0893 0.0998 0.0387 0.0802 0.0815 0.0875 0.1020 0.1150 0.1231 0.1130 0.1178 0.1149
va: 2.3107 2.1770 2.0228 5.4040 2.0998 2.1248 3.9254 3.9386 3.9445 3.9332 3.8779 3.8814 1.0106 1.0237 1.0126 1.0463 1.0067 1.0481 1.0074 1.0052 1.0144 0.9836 1.0034 0.9925 1.0016 0.9898 0.9889
dispcorr: -0.012482217 hartree
energy: -1924.231569605173
dipole: 5.64188 -6.29203 -0.65015 -6.81189 6.63305 -0.17884 2.95307 -2.77188 0.18119
magnitude: 0.69822 au
magnitude: 1.77474 debye
