program: Orca
programVersion: 5.0.2
elementType: S S S P O O C C C C C C H H H H H H H H H H H H H H H
charge: 0
multiplicity: 1
keywords: wb97x-d3
keywords: def2-TZVPP
keywords: def2/J RIJCOSX
keywords: DEFGRID2
keywords: scfconv7
keywords: smallprint printgap noloewdin
keywords: NOSOSCF
formula: C6H15O2PS3
InChI: InChI=1/C6H15O2PS3/c1-4-11-5-6-12-9(10,7-2)8-3/h4-6H2,1-3H3
27 atoms
S  0.093306 1.017922 0.506998
S  2.306756 -0.2152 -1.77786
S  -1.689802 -1.860766 0.821875
P  -1.731439 -0.002766 0.329579
O  -2.742801 0.947321 1.124251
O  -2.265779 0.358971 -1.130824
C  1.2755 -0.316632 0.855105
C  1.706434 -1.138125 -0.345817
C  3.646836 0.771737 -1.059248
C  4.788836 -0.04754 -0.486534
C  -2.74155 0.924341 2.544693
C  -1.622854 -0.201587 -2.268121
H  0.845351 -0.976469 1.609435
H  2.125691 0.191169 1.313522
H  0.861542 -1.724066 -0.710817
H  2.459723 -1.858754 -0.01799
H  4.000028 1.387793 -1.888005
H  3.242266 1.465259 -0.31897
H  5.585686 0.606314 -0.127909
H  4.468878 -0.659311 0.357715
H  5.207562 -0.713571 -1.239979
H  -2.953488 -0.076043 2.925133
H  -3.522814 1.607137 2.868341
H  -1.783016 1.263684 2.943616
H  -1.644909 -1.292478 -2.236096
H  -0.587832 0.140538 -2.345403
H  -2.176368 0.14035 -3.138583
totalener: -1924.22031427 hartree
nucrepener: 1283.44277613 hartree
electener: -3207.66309039 hartree
oneelecener: -5206.00093359 hartree
twoeener: 1998.33784320 hartree
kineticenergy: 1919.67802681 hartree
xcener: -112.338439933616 hartree
chargesum: -0.0000000
charge: -0.157173 -0.106682 -0.402788 0.628448 -0.308848 -0.295012 -0.137176 -0.171753 -0.116557 -0.244867 -0.124456 -0.130079 0.130291 0.115228 0.110038 0.109771 0.107509 0.078493 0.090341 0.068693 0.091152 0.114055 0.118577 0.098574 0.110760 0.103277 0.120184
qa: -0.1572 -0.1067 -0.4028 0.6284 -0.3088 -0.2950 -0.1372 -0.1718 -0.1166 -0.2449 -0.1245 -0.1301 0.1303 0.1152 0.1100 0.1098 0.1075 0.0785 0.0903 0.0687 0.0912 0.1141 0.1186 0.0986 0.1108 0.1033 0.1202
va: 2.2969 2.2121 2.0526 5.4212 2.1303 2.1353 3.8631 3.9750 3.9674 3.9247 3.8748 3.8524 1.0376 0.9994 1.0309 1.0080 1.0041 1.0097 1.0065 1.0032 1.0129 1.0001 0.9934 0.9977 0.9995 1.0152 0.9978
dispcorr: -0.012125343 hartree
energy: -1924.232439608966
dipole: 17.11720 -16.14002 0.97719 0.31474 0.10911 0.42385 0.42791 0.03066 0.45857
magnitude: 1.15967 au
magnitude: 2.94764 debye
