program: Orca
programVersion: 5.0.2
elementType: S S S P O O C C C C C C H H H H H H H H H H H H H H H
charge: 0
multiplicity: 1
keywords: wb97x-d3
keywords: def2-TZVPP
keywords: def2/J RIJCOSX
keywords: DEFGRID2
keywords: scfconv7
keywords: smallprint printgap noloewdin
keywords: NOSOSCF
formula: C6H15O2PS3
InChI: InChI=1/C6H15O2PS3/c1-4-11-5-6-12-9(10,7-2)8-3/h4-6H2,1-3H3
27 atoms
S  -0.109799 1.3416 0.753155
S  3.124639 -1.179837 -0.96744
S  -1.49108 -1.773083 0.548608
P  -1.702373 0.110412 0.229983
O  -2.926915 0.82801 0.985717
O  -1.994062 0.545513 -1.282847
C  1.29829 0.186566 0.598766
C  1.636037 -0.147211 -0.84196
C  4.390784 0.057821 -1.364796
C  4.663206 1.076799 -0.273932
C  -3.165112 0.556649 2.360737
C  -2.96974 -0.15657 -2.049312
H  1.075494 -0.714868 1.168957
H  2.12254 0.699762 1.093243
H  1.767865 0.756806 -1.438803
H  0.819663 -0.713906 -1.290513
H  5.288065 -0.529749 -1.566961
H  4.123922 0.550606 -2.301846
H  5.49983 1.719681 -0.552738
H  3.804038 1.726508 -0.105156
H  4.910135 0.587752 0.667542
H  -2.342467 0.917331 2.981612
H  -3.299295 -0.511788 2.535243
H  -4.074827 1.086115 2.632875
H  -2.795459 -1.233134 -2.020321
H  -2.874921 0.196936 -3.072822
H  -3.97805 0.05335 -1.6903
totalener: -1924.22105187 hartree
nucrepener: 1249.12833128 hartree
electener: -3173.34938315 hartree
oneelecener: -5137.48087513 hartree
twoeener: 1964.13149198 hartree
kineticenergy: 1919.67375211 hartree
xcener: -112.330159289521 hartree
chargesum: -0.0000000
charge: -0.147915 -0.113966 -0.401452 0.620273 -0.331843 -0.310164 -0.130919 -0.135661 -0.120183 -0.251866 -0.119293 -0.126987 0.130038 0.115277 0.095879 0.117753 0.097265 0.086136 0.093496 0.069360 0.090118 0.102853 0.112512 0.116419 0.110191 0.117225 0.115454
qa: -0.1479 -0.1140 -0.4015 0.6203 -0.3318 -0.3102 -0.1309 -0.1357 -0.1202 -0.2519 -0.1193 -0.1270 0.1300 0.1153 0.0959 0.1178 0.0973 0.0861 0.0935 0.0694 0.0901 0.1029 0.1125 0.1164 0.1102 0.1172 0.1155
va: 2.3004 2.1975 2.0495 5.4141 2.1019 2.0990 3.8931 3.9086 3.9854 3.8990 3.8754 3.8707 1.0365 1.0114 1.0201 1.0347 1.0045 1.0090 1.0087 1.0017 1.0121 0.9951 1.0039 0.9915 1.0047 0.9895 0.9906
dispcorr: -0.010967356 hartree
energy: -1924.232019226943
dipole: 10.94547 -11.01953 -0.07406 4.42127 -3.53631 0.88496 -2.52999 2.44553 -0.08446
magnitude: 0.89206 au
magnitude: 2.26744 debye
