program: Gaussian 09
title: 000066869
version: EM64L-G09RevD.01
frameworkgroup: C1[X(C13H14N2O)]
method: RPBEPBE
basis: SDD
operation: Freq
keyword: #p
keyword: freq=noraman
keyword: PBEPBE/SDD
title: #p freq=noraman PBEPBE/SDD
converged: YES YES NO NO
title: Mulliken charges:
elementType: O N N C C C C C C C C C C C C C H H H H H H H H H H H H H H
charge: -0.270745 -0.522696 -0.703543 0.463308 0.464122 -0.462069 -0.370367 -0.440341 -0.373457 0.312862 0.501278 -0.327991 -0.355074 -0.400117 -0.419209 -0.538065 0.287268 0.219579 0.265704 0.224260 0.261574 0.235800 0.245134 0.213603 0.214344 0.299953 0.301358 0.216381 0.215972 0.241172
chargesum: 0.00000
title: Mulliken charges with hydrogens summed into heavy atoms:
elementType: O N N C C C C C C C C C C C C C
charge: -0.270745 -0.235428 -0.102232 0.463308 0.464122 -0.242490 -0.104662 -0.216081 -0.111883 0.312862 0.501278 -0.092191 -0.109940 -0.186514 -0.204865 0.135461
polarizability: 3.07159135e+02 5.69024623e+00 1.46102925e+02 9.05647627e+00 -1.58481774e+00 8.30228714e+01
1716.lowfreq: -0.0001 0.0005 0.0007 1.0655 3.5029 12.2865 29.5908 41.8010 72.9391
frequency: 29.5382 41.7894 72.9386 85.4606 146.1513 154.6676 200.1847 240.8540 260.7461 284.7576 308.9728 327.7520 337.8896 354.4292 381.1824 410.3977 416.1382 430.8204 450.6069 501.6748 509.7921 511.7081 583.9655 632.7097 636.6896 701.9784 708.8694 736.4967 780.1934 793.5227 806.4447 813.9972 822.7778 836.9355 867.3604 908.5270 919.8160 938.1710 965.6264 988.4705 995.1492 999.7452 1015.0815 1112.2836 1114.6102 1131.5448 1158.4200 1177.4568 1186.9599 1217.9333 1228.7226 1270.0880 1299.8386 1311.7451 1328.6552 1362.2689 1381.0007 1421.6863 1436.1641 1442.5708 1465.2939 1474.9830 1488.5833 1510.2820 1521.4526 1582.9782 1590.2850 1633.1990 1634.5396 1650.5919 2949.0681 3032.5496 3109.9417 3114.4480 3117.8079 3118.4734 3134.7007 3149.6568 3158.3781 3159.9771 3172.4099 3548.6927 3572.3896 3713.0296
redmass: 4.0653 4.2458 3.9365 3.6770 4.5083 4.5248 3.8080 1.2650 3.4389 1.2129 4.1728 1.0424 4.5977 2.8374 2.5915 2.8732 2.9627 2.1103 3.0136 3.8798 3.0316 2.4110 4.8223 6.7986 6.5872 3.9105 3.5904 4.6145 3.2316 1.3757 1.5724 1.8734 2.7726 1.8566 5.1253 1.3745 1.3774 1.3411 1.2954 5.4510 2.7186 3.1179 1.4299 1.2613 1.3407 1.2313 1.3276 1.2216 1.1137 2.3990 3.4299 1.5153 2.1945 1.4478 1.9151 4.4222 6.5761 4.1017 1.1794 3.4164 1.0506 1.0801 1.8482 2.7293 3.3100 7.5398 4.2391 1.6295 3.2460 4.0022 1.0333 1.1035 1.0867 1.0894 1.0982 1.0891 1.0964 1.0879 1.0937 1.0943 1.0962 1.0754 1.0447 1.1041
irintensity: 2.7524 1.0261 0.4460 5.8480 4.5965 3.5356 5.9561 1.0391 7.0496 302.9758 5.8908 0.4699 13.4963 42.8760 22.2604 2.7810 3.8075 70.1493 56.2150 18.0158 8.5571 27.0668 8.9033 0.8802 0.8141 2.4432 6.6834 13.2031 20.2916 30.0783 5.7866 122.3204 20.3801 12.2707 0.9599 0.0520 0.1812 0.8208 0.2478 34.4641 0.0992 48.0227 0.4703 0.2199 10.5387 24.9889 0.9930 44.1601 1.8769 219.1799 97.4942 1.9656 121.3211 14.9458 1.0582 74.1565 17.7691 3.8933 22.2280 3.2051 12.7664 107.3115 53.1271 368.8110 673.4266 0.1909 13.9197 144.3721 1.8846 69.9657 97.3634 57.5366 24.3049 32.6451 19.6042 34.0392 29.8266 12.7874 22.2908 3.1989 4.1853 15.3351 87.2730 18.7883
temp: 298.150 k
press: 1.00000 atm
elementType: 8 7 7 6 6 6 6 6 6 6 6 6 6 6 6 6 1 1 1 1 1 1 1 1 1 1 1 1 1 1
symmnumber: 1
zpe: 634598.8 jmol-1
zpe.correction: 0.241706 hartree
zpe.thermalcorrener: 0.256629 hartree
zpe.thermalcorrenthalpy: 0.257573 hartree
zpe.thermalcorrgfe: 0.199321 hartree
zpe.sumelectzpe: -687.350375 hartree
zpe.sumelectthermal: -687.335452 hartree
zpe.sumelectthermalent: -687.334508 hartree
zpe.sumelectthermalfe: -687.392760 hartree
dipole: -1.6655 1.2678 0.6660
dipole: 2.1966
quadrupole: -60.3001 -84.1599 -100.1430
quadrupole: 10.5982 5.5615 -1.7177
quadrupole: 21.2342 -2.6255 -18.6087 10.5982 5.5615 -1.7177
hfenergy: -687.5920813 hartree
pointgroup: C01 [X(C13H14N2O1)]
dipole: 0.6632143 0.4918725 -0.2550618 debye
polarizability: 306.7497622|-7.0652056|146.2266761|12.2296409|1.1161899|83.3084928 unknown
InChI: InChI=1S/C13H14N2O/c1-16-13-8-6-12(7-9-13)15-11-4-2-10(14)3-5-11/h2-9,15H,14H2,1H3
charge 0 multiplicity 1
30 atoms
O  -4.767474 -1.023007 0.167294
N  0.417509 1.272622 -0.074997
N  5.592172 -1.108544 -0.011945
C  -0.865557 0.6827 -0.040663
C  1.686194 0.632712 -0.040115
C  -1.982758 1.4331 -0.497635
C  -1.103538 -0.623058 0.482583
C  2.801388 1.338088 0.488898
C  1.91122 -0.667809 -0.568526
C  -3.510069 -0.390202 0.070077
C  4.313737 -0.535026 -0.023409
C  -3.294567 0.913926 -0.436562
C  -2.405633 -1.14915 0.529206
C  4.092113 0.775777 0.486156
C  3.19608 -1.243188 -0.549868
C  -5.928608 -0.266344 -0.295475
H  0.435913 2.290886 -0.139611
H  -1.823706 2.437295 -0.91106
H  -0.272411 -1.212047 0.880109
H  2.652555 2.339291 0.913015
H  1.083831 -1.222123 -1.021874
H  -4.125875 1.528699 -0.794971
H  -2.590458 -2.1490 0.934655
H  4.932733 1.349718 0.89555
H  3.338434 -2.249187 -0.964336
H  6.386787 -0.601585 0.364602
H  5.745793 -2.043548 -0.375821
H  -5.848138 -0.017135 -1.372581
H  -6.064572 0.666601 0.287603
H  -6.790893 -0.930561 -0.134199
