program: Orca
programVersion: 5.0.2
elementType: Cl Cl Cl Cl P O O O O C C C C C C C C C C H H H H H H H H H
charge: 0
multiplicity: 1
keywords: wb97x-d3
keywords: def2-TZVPP
keywords: def2/J RIJCOSX
keywords: DEFGRID2
keywords: scfconv7
keywords: smallprint printgap noloewdin
keywords: NOSOSCF
formula: C10H9Cl4O4P
InChI: InChI=1/C10H9Cl4O4P/c1-16-19(15,17-2)18-10(5-11)6-3-8(13)9(14)4-7(6)12/h3-5H,1-2H3
28 atoms
Cl -0.328275 -1.605415 -2.251676
Cl 3.558851 1.246684 1.653012
Cl 4.303389 -1.547407 0.411505
Cl -2.519966 3.002088 -1.766039
P  -2.182629 -0.163339 1.016052
O  -2.046748 0.382471 -0.507292
O  -3.723443 -0.490666 1.087373
O  -1.424054 -1.553799 0.960443
O  -1.730302 0.79314 2.043862
C  0.384679 0.417976 -0.609199
C  -0.915298 1.05454 -0.892579
C  0.735606 -0.817064 -1.152016
C  1.272575 1.037232 0.259906
C  2.487675 0.449988 0.572464
C  1.938927 -1.419589 -0.840789
C  2.815142 -0.784775 0.02671
C  -1.011152 2.230982 -1.495728
C  -4.388347 -1.380969 0.176166
C  -0.464645 -1.950941 1.950769
H  1.003981 1.98735 0.701245
H  2.201754 -2.376007 -1.271067
H  -0.140829 2.753215 -1.866655
H  -4.520518 -0.904565 -0.793762
H  -5.362022 -1.594873 0.607122
H  -3.841186 -2.314776 0.055779
H  0.281502 -1.176844 2.119206
H  0.026594 -2.838494 1.564262
H  -0.958738 -2.193905 2.888865
elementType: Cl P O C H
totalener: -2869.75096000 hartree
nucrepener: 2308.44719783 hartree
electener: -5178.19815783 hartree
oneelecener: -8550.36262721 hartree
twoeener: 3372.16446938 hartree
cpcmener: -0.03096318 hartree
kineticenergy: 2863.49862530 hartree
xcener: -165.286924800438 hartree
chargesum: 0.0000000
charge: -0.052229 -0.055982 -0.050933 -0.083082 0.945086 -0.323219 -0.354004 -0.336182 -0.628932 0.042910 0.091852 0.071860 -0.129217 0.047537 -0.127709 0.050945 -0.083461 -0.103378 -0.124203 0.139400 0.127946 0.160116 0.121942 0.129332 0.121367 0.123324 0.131254 0.147660
qa: -0.0522 -0.0560 -0.0509 -0.0831 0.9451 -0.3232 -0.3540 -0.3362 -0.6289 0.0429 0.0919 0.0719 -0.1292 0.0475 -0.1277 0.0509 -0.0835 -0.1034 -0.1242 0.1394 0.1279 0.1601 0.1219 0.1293 0.1214 0.1233 0.1313 0.1477
va: 1.2724 1.2593 1.2654 1.2297 5.5753 2.0929 2.1357 2.0570 1.9706 3.6316 3.8873 3.9067 4.0180 3.9443 4.0397 3.9580 4.0725 3.8257 3.8205 1.0175 1.0204 1.0026 0.9919 0.9900 0.9939 0.9828 0.9859 0.9936
dispcorr: -0.018398480 hartree
energy: -2869.769358482657
dipole: -15.46233 15.78079 0.31846 -9.44435 7.55168 -1.89266 5.52701 -6.46077 -0.93376
magnitude: 2.13436 au
magnitude: 5.42511 debye
