program: Orca
programVersion: 5.0.2
elementType: Cl Cl Cl Cl P O O O O C C C C C C C C C C H H H H H H H H H
charge: 0
multiplicity: 1
keywords: wb97x-d3
keywords: def2-TZVPP
keywords: def2/J RIJCOSX
keywords: DEFGRID2
keywords: scfconv7
keywords: smallprint printgap noloewdin
keywords: NOSOSCF
formula: C10H9Cl4O4P
InChI: InChI=1/C10H9Cl4O4P/c1-16-19(15,17-2)18-10(5-11)6-3-8(13)9(14)4-7(6)12/h3-5H,1-2H3
28 atoms
Cl 0.503702 -1.575965 2.400411
Cl 3.035497 1.502271 -2.352391
Cl 4.493905 -0.990163 -1.11089
Cl -2.405699 2.540966 2.287025
P  -2.1298 -0.80738 -0.483789
O  -1.857376 0.010017 0.890113
O  -3.690184 -1.045383 -0.381047
O  -1.996884 0.346885 -1.556006
O  -1.295594 -2.009463 -0.677273
C  0.532643 0.370766 0.530822
C  -0.769211 0.824788 1.055525
C  1.191875 -0.7339 1.065922
C  1.120776 1.048865 -0.527407
C  2.340836 0.640608 -1.039869
C  2.409212 -1.152859 0.565178
C  2.981976 -0.464431 -0.493796
C  -0.895258 1.976308 1.699474
C  -4.223595 -2.144176 0.377345
C  -1.506292 0.096614 -2.88339
H  0.613954 1.901976 -0.957635
H  2.916716 -2.006157 0.993236
H  -0.044099 2.610752 1.900566
H  -4.115479 -1.961685 1.446067
H  -3.736246 -3.082121 0.114108
H  -5.279288 -2.208488 0.129587
H  -2.255606 -0.427541 -3.475608
H  -0.581339 -0.478536 -2.86481
H  -1.312144 1.069608 -3.326381
elementType: Cl P O C H
totalener: -2869.75057193 hartree
nucrepener: 2287.33551629 hartree
electener: -5157.08608822 hartree
oneelecener: -8508.90731044 hartree
twoeener: 3351.82122222 hartree
cpcmener: -0.02922279 hartree
kineticenergy: 2863.49653062 hartree
xcener: -165.284061067430 hartree
chargesum: 0.0000000
charge: -0.052156 -0.054335 -0.050874 -0.086463 0.965559 -0.319625 -0.357001 -0.342722 -0.625585 0.087254 0.103773 0.013211 -0.161524 0.069704 -0.106434 0.038145 -0.089762 -0.111192 -0.113280 0.141602 0.127491 0.160688 0.127341 0.116341 0.129933 0.141914 0.116777 0.131217
qa: -0.0522 -0.0543 -0.0509 -0.0865 0.9656 -0.3196 -0.3570 -0.3427 -0.6256 0.0873 0.1038 0.0132 -0.1615 0.0697 -0.1064 0.0381 -0.0898 -0.1112 -0.1133 0.1416 0.1275 0.1607 0.1273 0.1163 0.1299 0.1419 0.1168 0.1312
va: 1.2710 1.2636 1.2656 1.2254 5.5799 2.1185 2.1232 2.0870 1.9535 3.6207 3.8813 3.9585 3.9733 3.9250 4.0630 3.9843 4.0508 3.8316 3.8179 1.0159 1.0200 1.0027 0.9879 0.9955 0.9887 0.9896 0.9933 0.9882
dispcorr: -0.017088765 hartree
energy: -2869.767660695149
dipole: -18.82230 18.48675 -0.33555 -5.50899 6.00220 0.49322 -6.89723 6.39906 -0.49817
magnitude: 0.77719 au
magnitude: 1.97546 debye
