program: Orca
programVersion: 5.0.2
elementType: Cl Cl Cl Cl P O O O O C C C C C C C C C C H H H H H H H H H
charge: 0
multiplicity: 1
keywords: wb97x-d3
keywords: def2-TZVPP
keywords: def2/J RIJCOSX
keywords: DEFGRID2
keywords: scfconv7
keywords: smallprint printgap noloewdin
keywords: NOSOSCF
formula: C10H9Cl4O4P
InChI: InChI=1/C10H9Cl4O4P/c1-16-19(15,17-2)18-10(5-11)6-3-8(13)9(14)4-7(6)12/h3-5H,1-2H3
28 atoms
Cl 0.083648 -0.729961 -2.891853
Cl 3.386749 0.4370 2.226862
Cl 4.4880 -1.525329 0.032323
Cl -2.527693 3.15973 -0.845568
P  -2.13028 -0.919783 0.370403
O  -1.93292 0.286141 -0.693757
O  -1.766974 -0.170132 1.720672
O  -3.692617 -1.140046 0.313721
O  -1.390329 -2.159601 0.077464
C  0.48703 0.467477 -0.504731
C  -0.835466 1.104799 -0.648824
C  0.986864 -0.414392 -1.461217
C  1.249517 0.720308 0.627552
C  2.48154 0.113542 0.803839
C  2.216218 -1.024512 -1.299693
C  2.963644 -0.761353 -0.162051
C  -0.982807 2.418406 -0.745836
C  -1.189423 -0.842891 2.849724
C  -4.645038 -0.080432 0.497635
H  0.867609 1.392072 1.384304
H  2.596948 -1.699826 -2.053414
H  -0.135515 3.088344 -0.777357
H  -0.502691 -1.630087 2.543036
H  -1.975664 -1.266828 3.47252
H  -0.642301 -0.09496 3.417314
H  -4.685094 0.556978 -0.383925
H  -4.413618 0.521141 1.375917
H  -5.611324 -0.555842 0.640156
elementType: Cl P O C H
totalener: -2869.75157928 hartree
nucrepener: 2296.39535263 hartree
electener: -5166.14693191 hartree
oneelecener: -8526.75440077 hartree
twoeener: 3360.60746887 hartree
cpcmener: -0.03214361 hartree
kineticenergy: 2863.49427631 hartree
xcener: -165.285636639458 hartree
chargesum: -0.0000000
charge: -0.051829 -0.054384 -0.051203 -0.082447 0.941514 -0.326289 -0.332202 -0.351414 -0.628245 0.087336 0.106122 0.012369 -0.168536 0.072521 -0.099321 0.031603 -0.080815 -0.104290 -0.106991 0.145329 0.129009 0.159956 0.118460 0.140535 0.123706 0.115426 0.123042 0.131037
qa: -0.0518 -0.0544 -0.0512 -0.0824 0.9415 -0.3263 -0.3322 -0.3514 -0.6282 0.0873 0.1061 0.0124 -0.1685 0.0725 -0.0993 0.0316 -0.0808 -0.1043 -0.1070 0.1453 0.1290 0.1600 0.1185 0.1405 0.1237 0.1154 0.1230 0.1310
va: 1.2717 1.2636 1.2648 1.2321 5.5872 2.0978 2.0608 2.1270 1.9789 3.6304 3.8768 3.9522 3.9875 3.9338 4.0531 3.9845 4.0585 3.8115 3.8294 1.0125 1.0190 1.0029 1.0004 0.9908 0.9868 0.9951 0.9917 0.9926
dispcorr: -0.017724465 hartree
energy: -2869.769303743949
dipole: -19.14665 18.69538 -0.45127 -0.66589 2.33932 1.67342 10.75357 -9.28015 1.47342
magnitude: 2.27485 au
magnitude: 5.78222 debye
