program: Orca
programVersion: 5.0.2
elementType: Cl Cl Cl Cl P O O O O C C C C C C C C C C H H H H H H H H H
charge: 0
multiplicity: 1
keywords: wb97x-d3
keywords: def2-TZVPP
keywords: def2/J RIJCOSX
keywords: DEFGRID2
keywords: scfconv7
keywords: smallprint printgap noloewdin
keywords: NOSOSCF
formula: C10H9Cl4O4P
InChI: InChI=1/C10H9Cl4O4P/c1-16-19(15,17-2)18-10(5-11)6-3-8(13)9(14)4-7(6)12/h3-5H,1-2H3
28 atoms
Cl -0.328534 -0.401411 2.713233
Cl 3.644047 0.072659 -2.032722
Cl 4.242572 -1.865233 0.37709
Cl -2.21516 3.603958 -0.06759
P  -2.466796 -0.393029 -0.689701
O  -1.966445 0.702246 0.401116
O  -1.502151 -1.629935 -0.444812
O  -3.85794 -0.802366 -0.071419
O  -2.5479 0.109354 -2.069876
C  0.45896 0.582274 0.312761
C  -0.784775 1.371161 0.251544
C  0.745659 -0.279689 1.371607
C  1.373975 0.673249 -0.728732
C  2.545176 -0.066652 -0.719942
C  1.906831 -1.02817 1.389631
C  2.807683 -0.924239 0.340513
C  -0.774456 2.688023 0.081528
C  -0.683318 -2.188298 -1.481192
C  -4.015985 -1.318674 1.258129
H  1.15498 1.318012 -1.569477
H  2.119564 -1.68888 2.218601
H  0.146634 3.252017 0.034584
H  -0.232052 -1.420524 -2.107453
H  -1.271006 -2.860907 -2.104871
H  0.10363 -2.753416 -0.98832
H  -3.824225 -0.545695 2.001425
H  -3.363588 -2.172558 1.437831
H  -5.050089 -1.642056 1.342048
elementType: Cl P O C H
totalener: -2869.76122554 hartree
nucrepener: 2301.64785744 hartree
electener: -5171.40908298 hartree
oneelecener: -8536.39282908 hartree
twoeener: 3364.98374610 hartree
cpcmener: -0.02681871 hartree
kineticenergy: 2863.49009218 hartree
xcener: -165.284576696509 hartree
chargesum: -0.0000000
charge: -0.053310 -0.051455 -0.049827 -0.075356 0.917598 -0.327682 -0.334138 -0.341319 -0.603763 0.068682 0.110763 0.049560 -0.188660 0.093126 -0.094358 0.007614 -0.081419 -0.122277 -0.109136 0.142730 0.124848 0.156300 0.118547 0.145393 0.126975 0.119957 0.119050 0.131554
qa: -0.0533 -0.0515 -0.0498 -0.0754 0.9176 -0.3277 -0.3341 -0.3413 -0.6038 0.0687 0.1108 0.0496 -0.1887 0.0931 -0.0944 0.0076 -0.0814 -0.1223 -0.1091 0.1427 0.1248 0.1563 0.1185 0.1454 0.1270 0.1200 0.1191 0.1316
va: 1.2693 1.2658 1.2656 1.2404 5.6070 2.0820 2.0503 2.1311 2.0154 3.6426 3.8543 3.9003 3.9990 3.9215 4.0389 3.9878 4.0849 3.8372 3.8284 1.0127 1.0206 1.0029 0.9868 0.9940 0.9850 0.9919 0.9938 0.9917
dispcorr: -0.018301769 hartree
energy: -2869.779527305137
dipole: -14.62274 15.61786 0.99512 -9.53703 8.28735 -1.24968 -0.52120 1.92007 1.39887
magnitude: 2.12339 au
magnitude: 5.39724 debye
