program: Orca
programVersion: 5.0.2
elementType: Cl Cl Cl Cl P O O O O C C C C C C C C C C H H H H H H H H H
charge: 0
multiplicity: 1
keywords: wb97x-d3
keywords: def2-TZVPP
keywords: def2/J RIJCOSX
keywords: DEFGRID2
keywords: scfconv7
keywords: smallprint printgap noloewdin
keywords: NOSOSCF
formula: C10H9Cl4O4P
InChI: InChI=1/C10H9Cl4O4P/c1-16-19(15,17-2)18-10(5-11)6-3-8(13)9(14)4-7(6)12/h3-5H,1-2H3
28 atoms
Cl -0.452898 -1.280703 -2.429824
Cl 3.650824 0.947546 1.652656
Cl 4.253177 -1.70287 0.07261
Cl -2.503872 3.226154 -1.428328
P  -2.083301 -0.232492 1.097742
O  -2.035767 0.536481 -0.330009
O  -3.639598 -0.396325 1.303923
O  -1.513212 -1.660663 0.702311
O  -1.419871 0.458295 2.215226
C  0.382196 0.499695 -0.580284
C  -0.910039 1.19506 -0.741052
C  0.670804 -0.671614 -1.277856
C  1.319071 0.983563 0.321995
C  2.518338 0.320921 0.524081
C  1.858167 -1.349407 -1.078088
C  2.782897 -0.852091 -0.172292
C  -1.00463 2.403344 -1.278062
C  -4.519543 -0.943451 0.313465
C  -0.68608 -2.420631 1.589869
H  1.101724 1.884901 0.879152
H  2.071055 -2.257468 -1.625179
H  -0.141277 2.924671 -1.666372
H  -4.648497 -0.248432 -0.515668
H  -5.479212 -1.096198 0.800414
H  -4.158378 -1.90046 -0.063424
H  -0.312797 -3.265618 1.016652
H  -1.261736 -2.793456 2.437596
H  0.157794 -1.835751 1.9548
elementType: Cl P O C H
totalener: -2869.76116625 hartree
nucrepener: 2305.16866589 hartree
electener: -5174.92983215 hartree
oneelecener: -8543.92454771 hartree
twoeener: 3368.99471556 hartree
cpcmener: -0.02473912 hartree
kineticenergy: 2863.50054141 hartree
xcener: -165.285375245142 hartree
chargesum: -0.0000000
charge: -0.051162 -0.053129 -0.049157 -0.082743 0.921633 -0.316101 -0.346731 -0.331510 -0.598202 0.049415 0.111534 0.043581 -0.134748 0.057666 -0.114438 0.034146 -0.089989 -0.103842 -0.120085 0.137998 0.127061 0.155699 0.118507 0.126265 0.119232 0.126404 0.143257 0.119441
qa: -0.0512 -0.0531 -0.0492 -0.0827 0.9216 -0.3161 -0.3467 -0.3315 -0.5982 0.0494 0.1115 0.0436 -0.1347 0.0577 -0.1144 0.0341 -0.0900 -0.1038 -0.1201 0.1380 0.1271 0.1557 0.1185 0.1263 0.1192 0.1264 0.1433 0.1194
va: 1.2717 1.2630 1.2671 1.2285 5.6008 2.1070 2.1376 2.0594 2.0103 3.6409 3.8872 3.9386 4.0228 3.9389 4.0245 3.9742 4.0667 3.8341 3.8268 1.0200 1.0204 1.0038 0.9931 0.9901 0.9935 0.9875 0.9918 0.9884
dispcorr: -0.018095703 hartree
energy: -2869.779261957124
dipole: -16.72870 16.59283 -0.13587 -9.45808 7.87524 -1.58284 4.98716 -6.09162 -1.10446
magnitude: 1.93486 au
magnitude: 4.91802 debye
