program: Orca
programVersion: 5.0.2
elementType: Cl Cl Cl Cl P O O O O C C C C C C C C C C H H H H H H H H H
charge: 0
multiplicity: 1
keywords: wb97x-d3
keywords: def2-TZVPP
keywords: def2/J RIJCOSX
keywords: DEFGRID2
keywords: scfconv7
keywords: smallprint printgap noloewdin
keywords: NOSOSCF
formula: C10H9Cl4O4P
InChI: InChI=1/C10H9Cl4O4P/c1-16-19(15,17-2)18-10(5-11)6-3-8(13)9(14)4-7(6)12/h3-5H,1-2H3
28 atoms
Cl -0.200225 -1.710849 -2.18831
Cl 3.506448 1.463044 1.642864
Cl 4.369341 -1.3642 0.562165
Cl -2.571482 2.804358 -1.988975
P  -2.14372 -0.177247 1.018523
O  -2.01944 0.30276 -0.528486
O  -3.687309 -0.489693 1.110838
O  -1.39416 -1.574969 0.993744
O  -1.677274 0.803019 2.011323
C  0.406784 0.408686 -0.627886
C  -0.913225 0.979469 -0.9601
C  0.811909 -0.836207 -1.10603
C  1.255315 1.101658 0.224028
C  2.483419 0.574302 0.588164
C  2.029446 -1.379209 -0.743062
C  2.864119 -0.673612 0.110353
C  -1.042117 2.101553 -1.654647
C  -4.37658 -1.354677 0.199383
C  -0.492294 -1.99153 2.024833
H  0.945441 2.062168 0.613317
H  2.335209 -2.344639 -1.122286
H  -0.186658 2.623595 -2.059518
H  -3.842593 -2.292658 0.046915
H  -4.527618 -0.860179 -0.759685
H  -5.344254 -1.569986 0.644988
H  0.159953 -2.744101 1.588457
H  -1.045287 -2.434281 2.853632
H  0.114088 -1.166285 2.397062
elementType: Cl P O C H
totalener: -2869.76097914 hartree
nucrepener: 2305.57781500 hartree
electener: -5175.33879415 hartree
oneelecener: -8544.65144928 hartree
twoeener: 3369.31265513 hartree
cpcmener: -0.02479903 hartree
kineticenergy: 2863.50166165 hartree
xcener: -165.285980799165 hartree
chargesum: -0.0000000
charge: -0.050542 -0.052624 -0.049417 -0.081797 0.925362 -0.318093 -0.347354 -0.332894 -0.599178 0.046223 0.103105 0.062609 -0.128402 0.045478 -0.137586 0.054397 -0.088866 -0.103817 -0.117701 0.137801 0.126227 0.156021 0.118941 0.118620 0.126803 0.124100 0.143144 0.119441
qa: -0.0505 -0.0526 -0.0494 -0.0818 0.9254 -0.3181 -0.3474 -0.3329 -0.5992 0.0462 0.1031 0.0626 -0.1284 0.0455 -0.1376 0.0544 -0.0889 -0.1038 -0.1177 0.1378 0.1262 0.1560 0.1189 0.1186 0.1268 0.1241 0.1431 0.1194
va: 1.2736 1.2634 1.2672 1.2303 5.5993 2.0992 2.1397 2.0598 2.0099 3.6395 3.8922 3.9149 4.0173 3.9502 4.0342 3.9558 4.0732 3.8345 3.8302 1.0192 1.0214 1.0038 0.9939 0.9925 0.9902 0.9846 0.9931 0.9911
dispcorr: -0.018237146 hartree
energy: -2869.779216290454
dipole: -15.74639 15.96600 0.21961 -9.64183 7.84565 -1.79618 5.73387 -6.51892 -0.78505
magnitude: 1.97251 au
magnitude: 5.01372 debye
