program: Orca
programVersion: 5.0.2
elementType: Cl Cl Cl Cl P O O O O C C C C C C C C C C H H H H H H H H H
charge: 0
multiplicity: 1
keywords: wb97x-d3
keywords: def2-TZVPP
keywords: def2/J RIJCOSX
keywords: DEFGRID2
keywords: scfconv7
keywords: smallprint printgap noloewdin
keywords: NOSOSCF
formula: C10H9Cl4O4P
InChI: InChI=1/C10H9Cl4O4P/c1-16-19(15,17-2)18-10(5-11)6-3-8(13)9(14)4-7(6)12/h3-5H,1-2H3
28 atoms
Cl 0.493442 -0.524585 -3.02246
Cl 3.027527 0.184622 2.603444
Cl 4.506724 -1.450103 0.354305
Cl -2.673491 2.600305 -1.851727
P  -2.358329 -0.631994 0.488264
O  -1.723427 0.859136 0.310192
O  -1.44212 -1.399201 1.517247
O  -3.654339 -0.298545 1.331393
O  -2.492941 -1.351691 -0.786992
C  0.516132 0.479292 -0.485813
C  -0.805403 1.103881 -0.676214
C  1.179148 -0.264603 -1.461595
C  1.116898 0.599054 0.765779
C  2.33597 0.012464 1.039933
C  2.407597 -0.8501 -1.200305
C  2.987858 -0.712338 0.047613
C  -1.108791 1.920198 -1.676027
C  -1.237335 -0.979138 2.872516
C  -4.727799 0.476994 0.776455
H  0.622956 1.171847 1.539678
H  2.909504 -1.426183 -1.965411
H  -0.390499 2.21525 -2.426285
H  -1.146381 0.103094 2.962912
H  -0.310765 -1.438248 3.207011
H  -2.056424 -1.326516 3.50068
H  -4.940978 0.191391 -0.253579
H  -4.492999 1.539316 0.822137
H  -5.605379 0.277179 1.385588
elementType: Cl P O C H
totalener: -2869.76210006 hartree
nucrepener: 2282.47164733 hartree
electener: -5152.23374738 hartree
oneelecener: -8498.71667910 hartree
twoeener: 3346.48293172 hartree
cpcmener: -0.02736761 hartree
kineticenergy: 2863.48723907 hartree
xcener: -165.282703284149 hartree
chargesum: -0.0000000
charge: -0.052143 -0.053703 -0.049607 -0.076701 0.910032 -0.346469 -0.341066 -0.332729 -0.591233 0.089939 0.134941 -0.017583 -0.124198 0.050192 -0.114318 0.041186 -0.070596 -0.123685 -0.109835 0.145707 0.126428 0.150445 0.121908 0.128481 0.136589 0.119731 0.117774 0.130513
qa: -0.0521 -0.0537 -0.0496 -0.0767 0.9100 -0.3465 -0.3411 -0.3327 -0.5912 0.0899 0.1349 -0.0176 -0.1242 0.0502 -0.1143 0.0412 -0.0706 -0.1237 -0.1098 0.1457 0.1264 0.1504 0.1219 0.1285 0.1366 0.1197 0.1178 0.1305
va: 1.2646 1.2648 1.2668 1.2414 5.6248 2.0521 2.0940 2.1105 2.0241 3.6014 3.7770 4.0303 3.9140 3.9541 4.0469 3.9856 4.0776 3.8309 3.8291 1.0133 1.0203 1.0113 0.9891 0.9897 0.9955 0.9940 0.9948 0.9922
dispcorr: -0.017593436 hartree
energy: -2869.779693492901
dipole: -19.57879 19.52338 -0.05541 0.69024 0.64968 1.33992 10.43819 -8.92532 1.51287
magnitude: 2.02169 au
magnitude: 5.13872 debye
