program: Orca
programVersion: 5.0.2
elementType: Cl Cl Cl Cl P O O O O C C C C C C C C C C H H H H H H H H H
charge: 0
multiplicity: 1
keywords: wb97x-d3
keywords: def2-TZVPP
keywords: def2/J RIJCOSX
keywords: DEFGRID2
keywords: scfconv7
keywords: smallprint printgap noloewdin
keywords: NOSOSCF
formula: C10H9Cl4O4P
InChI: InChI=1/C10H9Cl4O4P/c1-16-19(15,17-2)18-10(5-11)6-3-8(13)9(14)4-7(6)12/h3-5H,1-2H3
28 atoms
Cl -0.056289 0.495576 2.716157
Cl 3.462242 -0.747572 -2.243845
Cl 4.367761 -1.634196 0.639324
Cl -2.503129 3.362046 0.067227
P  -2.446442 -0.498891 -0.817344
O  -1.568789 0.824109 -1.128259
O  -1.427732 -1.617329 -0.32988
O  -3.144469 -0.078576 0.539026
O  -3.280362 -0.836209 -1.982614
C  0.52299 0.649912 0.061551
C  -0.735057 1.376281 -0.189561
C  0.925232 0.221203 1.324788
C  1.327503 0.329127 -1.027484
C  2.505758 -0.374303 -0.866891
C  2.109397 -0.475543 1.500042
C  2.903153 -0.771045 0.405536
C  -1.033462 2.537607 0.375667
C  -0.805527 -2.504886 -1.268278
C  -4.053435 -0.970621 1.198721
H  1.027721 0.639976 -2.01993
H  2.40924 -0.802935 2.486005
H  -0.354675 3.036455 1.052827
H  -0.23077 -3.219911 -0.685422
H  -0.132062 -1.968563 -1.937505
H  -1.549766 -3.039688 -1.857505
H  -4.491911 -0.415427 2.023512
H  -3.529753 -1.841971 1.591473
H  -4.847859 -1.293919 0.525806
elementType: Cl P O C H
totalener: -2869.76092351 hartree
nucrepener: 2298.71272585 hartree
electener: -5168.47364936 hartree
oneelecener: -8530.64800003 hartree
twoeener: 3362.17435067 hartree
cpcmener: -0.02604595 hartree
kineticenergy: 2863.49485761 hartree
xcener: -165.283135887212 hartree
chargesum: -0.0000000
charge: -0.055423 -0.052391 -0.049552 -0.073011 0.906186 -0.342858 -0.326980 -0.313784 -0.608201 0.061825 0.136470 -0.009770 -0.130888 0.058111 -0.108905 0.035786 -0.064383 -0.118458 -0.120341 0.138371 0.126110 0.155069 0.128507 0.122443 0.133210 0.127136 0.123280 0.122439
qa: -0.0554 -0.0524 -0.0496 -0.0730 0.9062 -0.3429 -0.3270 -0.3138 -0.6082 0.0618 0.1365 -0.0098 -0.1309 0.0581 -0.1089 0.0358 -0.0644 -0.1185 -0.1203 0.1384 0.1261 0.1551 0.1285 0.1224 0.1332 0.1271 0.1233 0.1224
va: 1.2610 1.2651 1.2671 1.2445 5.6104 2.1071 2.0672 2.1027 2.0206 3.6379 3.7734 3.9897 3.8736 3.9346 4.0484 3.9805 4.0713 3.8285 3.8391 1.0226 1.0202 1.0076 0.9892 0.9816 1.0012 0.9887 0.9914 0.9930
dispcorr: -0.017883542 hartree
energy: -2869.778807055254
dipole: -15.95885 16.91218 0.95333 -9.92057 9.10653 -0.81403 0.27618 1.24972 1.52590
magnitude: 1.97481 au
magnitude: 5.01956 debye
