program: Orca
programVersion: 5.0.2
elementType: Cl Cl Cl Cl P O O O O C C C C C C C C C C H H H H H H H H H
charge: 0
multiplicity: 1
keywords: wb97x-d3
keywords: def2-TZVPP
keywords: def2/J RIJCOSX
keywords: DEFGRID2
keywords: scfconv7
keywords: smallprint printgap noloewdin
keywords: NOSOSCF
formula: C10H9Cl4O4P
InChI: InChI=1/C10H9Cl4O4P/c1-16-19(15,17-2)18-10(5-11)6-3-8(13)9(14)4-7(6)12/h3-5H,1-2H3
28 atoms
Cl 0.424599 -0.911729 -2.880413
Cl 3.271635 0.593359 2.430371
Cl 4.665818 -1.275018 0.319188
Cl -2.662695 2.371915 -2.026283
P  -2.433749 -0.397624 0.653065
O  -1.61763 0.966242 0.335807
O  -1.519986 -1.036973 1.776463
O  -3.666572 0.139268 1.487606
O  -2.721064 -1.211393 -0.540842
C  0.573732 0.435009 -0.510179
C  -0.753785 1.037197 -0.725377
C  1.198001 -0.421214 -1.418298
C  1.236889 0.720322 0.682461
C  2.489274 0.203679 0.950936
C  2.456802 -0.939832 -1.161022
C  3.10586 -0.625721 0.019298
C  -1.100384 1.695931 -1.823262
C  -1.833134 -2.320969 2.332038
C  -4.76055 0.814297 0.851063
H  0.769615 1.374796 1.406955
H  2.930475 -1.599319 -1.875306
H  -0.41833 1.858268 -2.644044
H  -2.033622 -3.056518 1.552812
H  -2.692296 -2.252568 2.999375
H  -0.962825 -2.637115 2.901027
H  -5.046038 0.331635 -0.083551
H  -4.505422 1.856677 0.662431
H  -5.599943 0.772258 1.540479
elementType: Cl P O C H
totalener: -2869.76146839 hartree
nucrepener: 2259.89628277 hartree
electener: -5129.65775115 hartree
oneelecener: -8454.07140613 hartree
twoeener: 3324.41365498 hartree
cpcmener: -0.02370788 hartree
kineticenergy: 2863.48611233 hartree
xcener: -165.280575665240 hartree
chargesum: -0.0000000
charge: -0.054050 -0.052987 -0.050152 -0.074244 0.932207 -0.355442 -0.336165 -0.340663 -0.596693 0.093552 0.146792 -0.037063 -0.105817 0.050648 -0.105322 0.032165 -0.064593 -0.110569 -0.113285 0.132103 0.127158 0.150366 0.116332 0.124018 0.124630 0.118735 0.117381 0.130959
qa: -0.0541 -0.0530 -0.0502 -0.0742 0.9322 -0.3554 -0.3362 -0.3407 -0.5967 0.0936 0.1468 -0.0371 -0.1058 0.0506 -0.1053 0.0322 -0.0646 -0.1106 -0.1133 0.1321 0.1272 0.1504 0.1163 0.1240 0.1246 0.1187 0.1174 0.1310
va: 1.2624 1.2647 1.2665 1.2466 5.6363 2.0900 2.1180 2.1176 2.0020 3.6186 3.7411 4.0293 3.9418 3.9614 4.0336 3.9898 4.0821 3.8396 3.8305 1.0266 1.0198 1.0114 0.9942 0.9894 0.9887 0.9938 0.9948 0.9914
dispcorr: -0.016124239 hartree
energy: -2869.777592628633
dipole: -22.01523 21.72181 -0.29343 -3.85621 4.08565 0.22944 8.48171 -7.67977 0.80194
magnitude: 0.88422 au
magnitude: 2.24751 debye
