program: Orca
programVersion: 5.0.2
elementType: Cl Cl Cl Cl P O O O O C C C C C C C C C C H H H H H H H H H
charge: 0
multiplicity: 1
keywords: wb97x-d3
keywords: def2-TZVPP
keywords: def2/J RIJCOSX
keywords: DEFGRID2
keywords: scfconv7
keywords: smallprint printgap noloewdin
keywords: NOSOSCF
formula: C10H9Cl4O4P
InChI: InChI=1/C10H9Cl4O4P/c1-16-19(15,17-2)18-10(5-11)6-3-8(13)9(14)4-7(6)12/h3-5H,1-2H3
28 atoms
Cl -0.033572 -1.186223 -2.567167
Cl 3.461253 1.122202 2.017379
Cl 4.559069 -1.150498 0.140374
Cl -2.849251 2.428854 -1.951209
P  -1.917104 -0.307445 1.378576
O  -1.810084 0.96855 0.381331
O  -3.455376 -0.279297 1.736177
O  -1.668563 -1.519115 0.384404
O  -1.06598 -0.254098 2.577657
C  0.418826 0.511159 -0.490509
C  -0.933302 1.081027 -0.6581
C  0.920692 -0.501486 -1.306174
C  1.221694 0.988872 0.540878
C  2.495886 0.492097 0.744212
C  2.194831 -1.00778 -1.111275
C  2.983016 -0.510788 -0.087873
C  -1.283467 1.755722 -1.744836
C  -4.492961 -0.2956 0.746815
C  -0.860599 -2.643405 0.760762
H  0.849379 1.776801 1.182719
H  2.573371 -1.794631 -1.748969
H  -0.592822 1.9288 -2.557653
H  -5.431257 -0.40624 1.283876
H  -4.378767 -1.133507 0.059102
H  -4.511966 0.637696 0.185137
H  0.130291 -2.330971 1.08794
H  -0.765666 -3.265799 -0.124791
H  -1.339648 -3.220139 1.551488
elementType: Cl P O C H
totalener: -2869.75984758 hartree
nucrepener: 2302.03090757 hartree
electener: -5171.79075515 hartree
oneelecener: -8537.31636822 hartree
twoeener: 3365.52561307 hartree
cpcmener: -0.02487205 hartree
kineticenergy: 2863.47522435 hartree
xcener: -165.283489601528 hartree
chargesum: 0.0000000
charge: -0.055942 -0.050008 -0.049306 -0.083541 0.925485 -0.325823 -0.344970 -0.333504 -0.600155 0.042828 0.160039 -0.018015 -0.123767 0.066404 -0.088946 0.024436 -0.089738 -0.107085 -0.115074 0.139691 0.126671 0.154556 0.127803 0.121318 0.110852 0.117987 0.122306 0.145498
qa: -0.0559 -0.0500 -0.0493 -0.0835 0.9255 -0.3258 -0.3450 -0.3335 -0.6002 0.0428 0.1600 -0.0180 -0.1238 0.0664 -0.0889 0.0244 -0.0897 -0.1071 -0.1151 0.1397 0.1267 0.1546 0.1278 0.1213 0.1109 0.1180 0.1223 0.1455
va: 1.2589 1.2685 1.2667 1.2312 5.5902 2.1097 2.1328 2.0430 2.0141 3.6334 3.8146 3.9381 3.9509 3.9506 4.0191 3.9916 4.0416 3.8383 3.8219 1.0227 1.0211 1.0072 0.9919 0.9917 0.9997 0.9885 0.9928 0.9937
dispcorr: -0.018460629 hartree
energy: -2869.778308203975
dipole: -18.01628 17.49332 -0.52296 -8.73783 7.67091 -1.06693 2.81325 -4.62216 -1.80892
magnitude: 2.16426 au
magnitude: 5.50110 debye
