program: Orca
programVersion: 5.0.2
elementType: Cl Cl Cl Cl P O O O O C C C C C C C C C C H H H H H H H H H
charge: 0
multiplicity: 1
keywords: wb97x-d3
keywords: def2-TZVPP
keywords: def2/J RIJCOSX
keywords: DEFGRID2
keywords: scfconv7
keywords: smallprint printgap noloewdin
keywords: NOSOSCF
formula: C10H9Cl4O4P
InChI: InChI=1/C10H9Cl4O4P/c1-16-19(15,17-2)18-10(5-11)6-3-8(13)9(14)4-7(6)12/h3-5H,1-2H3
28 atoms
Cl 0.984677 -2.585872 1.363359
Cl 2.773675 2.538026 -1.654208
Cl 4.547348 -0.06631 -1.692306
Cl -2.363272 -0.09771 3.317711
P  -2.327881 -0.299291 -0.680707
O  -1.671903 0.581215 0.524238
O  -3.709099 -0.820584 -0.124484
O  -2.763054 0.828337 -1.702974
O  -1.446752 -1.377237 -1.154333
C  0.665425 0.012496 0.604849
C  -0.6421 0.087914 1.281586
C  1.464988 -1.129206 0.575963
C  1.099798 1.134033 -0.096463
C  2.287645 1.127448 -0.801993
C  2.660995 -1.145525 -0.12313
C  3.072564 -0.020415 -0.81558
C  -0.825586 -0.196617 2.563961
C  -4.744949 0.050365 0.351435
C  -1.788819 1.606098 -2.413148
H  0.498917 2.033663 -0.086406
H  3.266452 -2.041101 -0.146335
H  -0.013853 -0.49504 3.211471
H  -5.463322 -0.5771 0.871472
H  -5.240997 0.547347 -0.480445
H  -4.362259 0.796964 1.046013
H  -1.384034 2.389989 -1.773221
H  -2.304775 2.064433 -3.253128
H  -0.977174 0.985777 -2.793903
elementType: Cl P O C H
totalener: -2869.76139932 hartree
nucrepener: 2275.32803813 hartree
electener: -5145.08943745 hartree
oneelecener: -8484.55478024 hartree
twoeener: 3339.46534280 hartree
cpcmener: -0.02569985 hartree
kineticenergy: 2863.47844998 hartree
xcener: -165.281656494624 hartree
chargesum: -0.0000000
charge: -0.055966 -0.054018 -0.051045 -0.077221 0.925913 -0.358315 -0.343906 -0.328781 -0.594873 0.081812 0.159182 -0.016909 -0.130904 0.050854 -0.101685 0.033568 -0.074173 -0.116608 -0.107848 0.140972 0.124745 0.152158 0.131270 0.126287 0.111852 0.118347 0.135902 0.119390
qa: -0.0560 -0.0540 -0.0510 -0.0772 0.9259 -0.3583 -0.3439 -0.3288 -0.5949 0.0818 0.1592 -0.0169 -0.1309 0.0509 -0.1017 0.0336 -0.0742 -0.1166 -0.1078 0.1410 0.1247 0.1522 0.1313 0.1263 0.1119 0.1183 0.1359 0.1194
va: 1.2612 1.2651 1.2654 1.2408 5.6077 2.0583 2.1214 2.1035 2.0186 3.6305 3.7725 3.9758 3.9399 3.9570 4.0338 3.9835 4.0704 3.8349 3.8360 1.0118 1.0204 1.0106 0.9879 0.9940 0.9978 0.9893 0.9892 0.9924
dispcorr: -0.017339171 hartree
energy: -2869.778738488906
dipole: -21.08022 20.48385 -0.59637 5.92484 -4.09601 1.82883 -4.39516 4.79003 0.39487
magnitude: 1.96372 au
magnitude: 4.99139 debye
