program: Orca
programVersion: 5.0.2
elementType: Cl Cl Cl Cl P O O O O C C C C C C C C C C H H H H H H H H H
charge: 0
multiplicity: 1
keywords: wb97x-d3
keywords: def2-TZVPP
keywords: def2/J RIJCOSX
keywords: DEFGRID2
keywords: scfconv7
keywords: smallprint printgap noloewdin
keywords: NOSOSCF
formula: C10H9Cl4O4P
InChI: InChI=1/C10H9Cl4O4P/c1-16-19(15,17-2)18-10(5-11)6-3-8(13)9(14)4-7(6)12/h3-5H,1-2H3
28 atoms
Cl 0.970936 -1.892373 2.228015
Cl 2.532007 1.898414 -2.435385
Cl 4.399333 -0.494766 -1.603332
Cl -2.29891 1.101542 3.400442
P  -2.190331 -0.389765 -0.650382
O  -1.841225 0.656154 0.539462
O  -3.771743 -0.297458 -0.677622
O  -1.79011 0.450732 -1.929789
O  -1.586447 -1.723922 -0.490534
C  0.558903 0.276102 0.631175
C  -0.71908 0.557433 1.313954
C  1.388355 -0.793583 0.967561
C  0.940846 1.096299 -0.427244
C  2.109635 0.866266 -1.128122
C  2.569587 -1.023188 0.282236
C  2.932346 -0.194314 -0.764836
C  -0.803851 0.790815 2.617039
C  -4.544632 -0.93036 0.352752
C  -1.403582 -0.183941 -3.155543
H  0.319136 1.938806 -0.699365
H  3.204097 -1.855662 0.553297
H  0.066332 0.808908 3.257129
H  -5.589615 -0.789203 0.090713
H  -4.355431 -0.469687 1.322725
H  -4.331685 -1.997732 0.408585
H  -1.034961 0.603835 -3.807074
H  -2.256959 -0.668959 -3.628815
H  -0.609897 -0.912713 -2.996056
elementType: Cl P O C H
totalener: -2869.76068607 hartree
nucrepener: 2283.77014012 hartree
electener: -5153.53082619 hartree
oneelecener: -8501.53451795 hartree
twoeener: 3348.00369177 hartree
cpcmener: -0.02229492 hartree
kineticenergy: 2863.48663836 hartree
xcener: -165.282110102175 hartree
chargesum: -0.0000000
charge: -0.052567 -0.054637 -0.049453 -0.081834 0.956140 -0.334081 -0.347743 -0.344038 -0.596964 0.058674 0.146417 -0.018294 -0.113260 0.054048 -0.101921 0.033852 -0.085658 -0.112366 -0.117760 0.138111 0.125697 0.153989 0.128042 0.114017 0.118341 0.126541 0.137369 0.119338
qa: -0.0526 -0.0546 -0.0495 -0.0818 0.9561 -0.3341 -0.3477 -0.3440 -0.5970 0.0587 0.1464 -0.0183 -0.1133 0.0540 -0.1019 0.0339 -0.0857 -0.1124 -0.1178 0.1381 0.1257 0.1540 0.1280 0.1140 0.1183 0.1265 0.1374 0.1193
va: 1.2640 1.2622 1.2670 1.2329 5.5877 2.1220 2.1258 2.0900 1.9891 3.6063 3.8193 4.0059 3.9129 3.9429 4.0360 3.9903 4.0397 3.8445 3.8259 1.0252 1.0204 1.0082 0.9905 0.9979 0.9932 0.9901 0.9898 0.9932
dispcorr: -0.017244390 hartree
energy: -2869.777930458165
dipole: -19.43683 19.10049 -0.33634 -3.60641 3.92288 0.31648 -6.73724 6.41450 -0.32274
magnitude: 0.56342 au
magnitude: 1.43210 debye
