program: Orca
programVersion: 5.0.2
elementType: Cl Cl Cl Cl P O O O O C C C C C C C C C C H H H H H H H H H
charge: 0
multiplicity: 1
keywords: wb97x-d3
keywords: def2-TZVPP
keywords: def2/J RIJCOSX
keywords: DEFGRID2
keywords: scfconv7
keywords: smallprint printgap noloewdin
keywords: NOSOSCF
formula: C10H9Cl4O4P
InChI: InChI=1/C10H9Cl4O4P/c1-16-19(15,17-2)18-10(5-11)6-3-8(13)9(14)4-7(6)12/h3-5H,1-2H3
28 atoms
Cl 0.059636 1.337338 2.544816
Cl 3.449179 -1.188578 -2.003815
Cl 4.485358 -1.165145 0.969633
Cl -2.631349 3.194888 -0.642192
P  -2.301973 -0.881848 -0.648329
O  -1.626558 0.482775 -1.206728
O  -1.172636 -1.93325 -1.030773
O  -2.140263 -0.786547 0.937568
O  -3.653073 -1.10456 -1.165443
C  0.502736 0.681182 -0.066537
C  -0.790856 1.265714 -0.465268
C  0.97599 0.670983 1.244441
C  1.287913 0.083554 -1.048528
C  2.513406 -0.481601 -0.752587
C  2.202241 0.105865 1.554306
C  2.973827 -0.469593 0.560517
C  -1.118706 2.526217 -0.20692
C  -1.416317 -3.328212 -0.876081
C  -3.142985 -0.134405 1.71652
H  0.935588 0.067228 -2.070603
H  2.555842 0.103024 2.575252
H  -0.440815 3.195978 0.300777
H  -0.597383 -3.847141 -1.367443
H  -2.357312 -3.622621 -1.341134
H  -1.430446 -3.607814 0.17822
H  -3.198612 0.930365 1.485141
H  -2.853729 -0.252302 2.757197
H  -4.121661 -0.585064 1.554932
totalener: -2869.73964226 hartree
nucrepener: 2297.97860050 hartree
electener: -5167.71824277 hartree
oneelecener: -8529.08070410 hartree
twoeener: 3361.36246133 hartree
kineticenergy: 2863.54270184 hartree
xcener: -165.288690630657 hartree
chargesum: -0.0000000
charge: -0.055541 -0.036061 -0.035062 -0.050385 0.850771 -0.316197 -0.308689 -0.318792 -0.497812 0.100857 0.090926 -0.030158 -0.096823 0.043186 -0.113640 0.025353 -0.056502 -0.131309 -0.137976 0.116140 0.116327 0.123488 0.114632 0.124278 0.113005 0.112187 0.117658 0.136138
qa: -0.0555 -0.0361 -0.0351 -0.0504 0.8508 -0.3162 -0.3087 -0.3188 -0.4978 0.1009 0.0909 -0.0302 -0.0968 0.0432 -0.1136 0.0254 -0.0565 -0.1313 -0.1380 0.1161 0.1163 0.1235 0.1146 0.1243 0.1130 0.1122 0.1177 0.1361
va: 1.2607 1.2831 1.2826 1.2661 5.6346 2.1195 2.1091 2.0420 2.1448 3.5813 3.8233 4.0252 3.9400 3.9868 4.0381 4.0150 4.0502 3.8651 3.8583 1.0344 1.0242 1.0176 0.9909 0.9942 0.9892 0.9867 0.9901 1.0027
dispcorr: -0.017781741 hartree
energy: -2869.757424002395
dipole: -16.17335 16.83500 0.66164 -9.33178 9.02427 -0.30752 3.22650 -2.16146 1.06504
magnitude: 1.29099 au
magnitude: 3.28143 debye
