program: Orca
programVersion: 5.0.2
elementType: Cl Cl Cl Cl P O O O O C C C C C C C C C C H H H H H H H H H
charge: 0
multiplicity: 1
keywords: wb97x-d3
keywords: def2-TZVPP
keywords: def2/J RIJCOSX
keywords: DEFGRID2
keywords: scfconv7
keywords: smallprint printgap noloewdin
keywords: NOSOSCF
formula: C10H9Cl4O4P
InChI: InChI=1/C10H9Cl4O4P/c1-16-19(15,17-2)18-10(5-11)6-3-8(13)9(14)4-7(6)12/h3-5H,1-2H3
28 atoms
Cl 0.263949 -0.501645 2.80347
Cl 3.262579 0.329098 -2.565715
Cl 4.491329 -1.497458 -0.312307
Cl -2.315233 3.38548 0.90709
P  -2.227534 -0.487279 -0.690643
O  -1.873066 0.481028 0.572069
O  -1.689343 -1.910214 -0.208685
O  -3.79553 -0.5981 -0.545093
O  -1.741449 -0.007711 -1.986632
C  0.542173 0.566361 0.337645
C  -0.751279 1.25183 0.539199
C  1.087293 -0.266912 1.313077
C  1.229498 0.726726 -0.858181
C  2.447219 0.101245 -1.075113
C  2.300564 -0.899268 1.10895
C  2.984645 -0.712772 -0.083423
C  -0.827006 2.564648 0.708176
C  -0.677467 -2.617571 -0.921038
C  -4.462618 -0.936587 0.665373
H  0.794362 1.336014 -1.637761
H  2.722571 -1.531365 1.877189
H  0.061078 3.178017 0.748802
H  -0.855509 -3.678424 -0.762009
H  0.308968 -2.361843 -0.533688
H  -0.704821 -2.403061 -1.988249
H  -4.097868 -1.878642 1.076962
H  -5.51653 -1.043538 0.421546
H  -4.348386 -0.148443 1.40982
totalener: -2869.74064569 hartree
nucrepener: 2295.16829745 hartree
electener: -5164.90894314 hartree
oneelecener: -8523.60453800 hartree
twoeener: 3358.69559486 hartree
kineticenergy: 2863.54134567 hartree
xcener: -165.290521760585 hartree
chargesum: -0.0000000
charge: -0.033785 -0.030935 -0.033767 -0.058499 0.881812 -0.322320 -0.327451 -0.315296 -0.503610 -0.068929 0.168888 0.072097 -0.085100 0.033898 -0.150034 0.043118 -0.096039 -0.100130 -0.121777 0.134231 0.115346 0.121633 0.120887 0.084763 0.125324 0.111742 0.117266 0.116666
qa: -0.0338 -0.0309 -0.0338 -0.0585 0.8818 -0.3223 -0.3275 -0.3153 -0.5036 -0.0689 0.1689 0.0721 -0.0851 0.0339 -0.1500 0.0431 -0.0960 -0.1001 -0.1218 0.1342 0.1153 0.1216 0.1209 0.0848 0.1253 0.1117 0.1173 0.1167
va: 1.2888 1.2859 1.2821 1.2543 5.6224 2.1051 2.0703 2.1636 2.1122 3.7152 3.8392 3.9110 3.9624 3.9879 4.0449 3.9698 4.1218 3.8683 3.8656 1.0275 1.0294 1.0134 0.9938 0.9851 1.0011 0.9924 0.9892 0.9931
dispcorr: -0.017982214 hartree
energy: -2869.758627899788
dipole: -16.85220 16.90544 0.05324 -9.91271 9.04972 -0.86298 0.07363 0.86265 0.93628
magnitude: 1.27444 au
magnitude: 3.23937 debye
